{"text_format":"1","workbook":"xlsx","n_sheets":8,"sheets":["INSTRUCTIVO","SOLICITUD-DATOS SOC","SOCIOS","NO SOCIOS","PREGUNTAS","IMPRIMIR","LISTADOS","BD-GRAL"],"not_rendered":{"charts":0,"images":0,"macros":1,"external_links":0,"defined_names":2,"comments":0,"pivot_tables":0},"unopened":[],"bounds":{"document_bytes":16777216,"sheet_cells":100000,"rows_first":2000,"rows_last":500,"rows_between":2000,"halvings":0,"cell_chars":16384,"cell_head_chars":4096},"cells_cut":0,"cells_raw":0,"read":"whole","date_system":"1900"}

{"sheet":"INSTRUCTIVO","index":0,"n_rows":27,"n_cols":2,"rows_kept":27,"cut":false,"hidden":false,"merged":[[8,1,8,7],[26,1,26,7],[0,0,0,7],[5,1,5,7],[4,1,4,7],[7,1,7,7],[6,1,6,7],[2,1,2,7],[3,1,3,7]]}
["INSTRUCCIONES DE LLENADO -POR FAVOR SEGUIR EL ORDEN-"]
[]
[1,"GUARDAR ARCHIVO:  ELEGIR LA OPCIÓN \"GUARDAR COMO\". PONER NOMBRE DE LA SOCIEDAD Y ELEGIR COMO TIPO: \"ARCHIVO EXCEL HABILITADO PARA MACRO\"."]
[2,"POSICIONARSE EN SOLAPA \"SOLICITUD-DATOS SOC\", Y COMPLETAR DATOS."]
[3,"POSICIONARSE EN SOLAPA \"SOCIOS\", Y COMPLETAR DATOS SEGÚN SEA SOCIOS HUMANO/S O PERSONA/S. JURÍDICA."]
[4,"POSICIONARSE EN SOLAPA \"NO SOCIOS\". Para el caso que exista miembros de los órganos de representación, administración y/o fiscalización que NO sean SOCIOS."]
[5,"POSICIONARSE EN SOLAPA \"PREGUNTAS\". RESPONDER DATOS Y VERIFICAR QUE NO HAYA INCONSISTENCIAS."]
[6,"POSICIONARSE EN SOLAPA \"IMPRIMIR\". DEBE PRESIONAR PRIMERO LOS BOTONES UNO (1º) E IMPRIMIR -IR A LA SOLAPA SUPERIOR DE LA HOJA \"ARCHIVO\" y elegir opción \"IMPRIMIR\"-"]
[7,"UNA VEZ IMPRESA FIRMAR EN TODAS LAS PÁGINAS LOS SOCIO/AS, REP. LEGALES, GESTOR, APODERADO/A, ESCRIBANO/A, Y NO SOCIOS INTERVINIENTES. LA FIRMA SE DEBE CERTIFICAR POR ANTE EL FUNCIONARIO DE LA UNIDAD JUEZ DE PAZ, O POR ANTE BANCO."]
[8,"TENER EN CUENTA: DEBERA COMPLETARSE CADA CELDA SIN AGREGAR PUNTOS, GUIONES NI CUALQUIER OTRO SIMBOLO, CASO CONTRARIO NO PERMITIRA COMPRIMIR EL ARCHIVO Y QUEDARAN CELDAS INCOMPLETAS."]
[null,"REFERENCIA: "]
[null,"a GESTOR: Quien inicia el trámite."]
[null,"b SOCIEDAD: Datos de la sociedad a inscribir."]
[null,"c SOCIO PH: Socio/a persona humana."]
[null,"c SOCIO PJ: Socio persona jurídica."]
[null,"d CANT. ACC. : Cantidad de acciones sucriptas."]
[null,"d CANT. ACC. TOT. : Total de acciones sucriptas."]
[null,"e CAP. SUSCR.: Capital Total Suscripto (Capital Social)."]
[null,"f PARTICIPACION: Porción de participación que tiene cada socio/a en el capital social."]
[null,"g AP. DINERO: Aportes en dinero del/los socio/a/s,"]
[null,"g AP. ESPECIE: Aportes NO dinerarios (en especie) del/los socio/a/s,"]
[null,"h CAP. INTEG.: Capital mínimo a integrar al momento de la constitución por cada socio/a."]
[null,"h CAP. INTEG. TOT.: Capital mínimo a integrar al momento de la constitución total."]
[null,"i ORG. REP. LEGAL/ ADM.: Miembro/s del órgano representación/ administración."]
[null,"j ORG. FISCALIZ.: Miembro/s del órgano de fiscalización."]
[null,"kn DATO ADIC: Datos adicionales."]
[null,"l NO SOCIO: Datos de las personas humanas NO socias que forman parte de los órganos de administración, fiscalización o son respresentante/s legal/es."]

{"sheet":"SOLICITUD-DATOS SOC","index":1,"n_rows":36,"n_cols":12,"rows_kept":36,"cut":false,"hidden":false,"merged":[[18,5,18,6],[19,5,19,6],[17,5,17,6],[34,5,34,7],[35,5,35,7],[30,5,30,6],[32,5,32,6],[29,5,29,7],[31,5,31,7],[33,5,33,8],[20,5,20,6],[21,5,21,6],[22,5,22,6],[23,5,23,6],[24,5,24,6],[26,0,28,0],[26,1,28,1],[26,2,28,2],[26,3,26,4],[27,3,28,3],[27,4,28,4],[9,3,9,4],[10,3,10,4],[11,3,11,4],[12,3,12,4],[13,3,13,4],[2,0,2,4],[3,0,3,2],[1,0,1,4],[6,3,8,4],[6,0,8,0],[6,1,8,1],[3,3,3,5],[4,4,4,5],[6,2,8,2]]}
["DATOS SOCIALES "]
["(COMPLETAR CELDAS CON FONDO VERDE)"]
["Unidad de Registro Publico y Contralor de Personas Jurídicas Av. San Martin N° 2034 - Río Gallegos "]
["NOMBRE DE LA SOCIEDAD:"]
[null,null,"FECHA:",null,{"$f":"+IF(D5=0,\"CAMPO OBLIGATORIO, CAUSAL DE RECHAZO\",\"\")","v":"CAMPO OBLIGATORIO, CAUSAL DE RECHAZO"}]
["ANEXO I (GESTIÓN/TRÁMITE)       "]
["REFER.","APELLIDO/s DEL GESTIONANTE","NOMBRE/s DEL DEL GESTIONANTE","DATOS"]
[]
[]
[]
[]
[]
[]
[]
[null,null,null,null,"COMPLETAR"]
[null,null,null,"CONCEPTO"]
[null,null,null,null,"-EN MAYUSCULA -"]
["aa GESTOR",null,null,"TRAMITE QUE SE INICIA:","ELEGIR",{"$f":"+IF(OR(B18=0,C18=0),\"FALTA APELL/NOMB DEL GEST, CAUSAL DE RECHAZO\",\"\")","v":"FALTA APELL/NOMB DEL GEST, CAUSAL DE RECHAZO"},null,null,null,null,null,1]
["ab GESTOR",{"$f":"B$18","v":0},{"$f":"C$18","v":0},"DOMICILIO PROCESAL CONSTITUIDO -art.40 CPCC-:",null,{"$f":"+IF(E19=0,\"CAMPO OBLIGATORIO, CAUSAL DE RECHAZO\",\"\")","v":"CAMPO OBLIGATORIO, CAUSAL DE RECHAZO"},null,null,null,null,null,2]
["ac GESTOR",{"$f":"B$18","v":0},{"$f":"C$18","v":0},"CARÁCTER DEL GESTIONANTE:",null,{"$f":"+IF(E20=0,\"CAMPO OBLIGATORIO, CAUSAL DE RECHAZO\",\"\")","v":"CAMPO OBLIGATORIO, CAUSAL DE RECHAZO"},null,null,null,null,null,3]
["ad GESTOR",{"$f":"IF(OR($E$20=\"ESCRIBANO/A\",$E$20=\"APODERADO/A LETRADO/A\"),0,$B18)","v":0},{"$f":"IF(OR($E$20=\"ESCRIBANO/A\",$E$20=\"APODERADO/A LETRADO/A\"),0,$C18)","v":0},{"$f":"IF(OR(E$20=\"ESCRIBANO/A\",E$20=\"APODERADO/A LETRADO/A\"),\"\",\"LETRADO/A/S PATROCINANTE/S:\")","v":"LETRADO/A/S PATROCINANTE/S:"},null,{"$f":"+IF(D21=\"\",\"\",IF(E21=0,\"CAMPO OBLIGATORIO, CAUSAL DE RECHAZO\",\"\"))","v":"CAMPO OBLIGATORIO, CAUSAL DE RECHAZO"},null,null,null,null,null,4]
["ae GESTOR",{"$f":"IF(OR($E$20=\"ESCRIBANO/A\",$E$20=\"APODERADO/A LETRADO/A\"),0,$B19)","v":0},{"$f":"IF(OR($E$20=\"ESCRIBANO/A\",$E$20=\"APODERADO/A LETRADO/A\"),0,$C19)","v":0},{"$f":"IF(OR(E$20=\"ESCRIBANO/A\",E$20=\"APODERADO/A LETRADO/A\"),\"\",\"DOC. IDENTIDAD –sin puntos-:\")","v":"DOC. IDENTIDAD –sin puntos-:"},null,{"$f":"+IF(D22=\"\",\"\",IF(E22=0,\"CAMPO OBLIGATORIO, CAUSAL DE RECHAZO\",\"\"))","v":"CAMPO OBLIGATORIO, CAUSAL DE RECHAZO"},null,null,null,null,null,5]
["af GESTOR",0,0,{"$f":"IF(OR(E$20=\"ESCRIBANO/A\",E$20=\"APODERADO/A LETRADO/A\"),\"\",\"DOMICILIO REAL -indicar Ciudad/Pcia./País\")","v":"DOMICILIO REAL -indicar Ciudad/Pcia./País"},null,"CAMPO OBLIGATORIO, CAUSAL DE RECHAZO",null,null,null,null,null,6]
["ag GESTOR",0,0,{"$f":"IF(OR(E$20=\"ESCRIBANO/A\",E$20=\"APODERADO/A LETRADO/A\"),\"\",\"CEL/TEL -c/código de área, sin puntos o barras-:\")","v":"CEL/TEL -c/código de área, sin puntos o barras-:"},null,"CAMPO OBLIGATORIO, CAUSAL DE RECHAZO",null,null,null,null,null,7]
["ah GESTOR",0,0,{"$f":"IF(OR(E$20=\"ESCRIBANO/A\",E$20=\"APODERADO/A LETRADO/A\"),\"\",\"EMAIL -OBLIGATORIO-:\")","v":"EMAIL -OBLIGATORIO-:"},null,"CAMPO OBLIGATORIO, CAUSAL DE RECHAZO",null,null,null,null,null,8]
["ANEXO II -DATOS DE LA SOCIEDAD-"]
["REFER.","NOMBRE SOCIEDAD","NOMBRE SOCIEDAD","DATOS"]
[null,null,null,"CONCEPTO","COMPLETAR -EN MAYUSCULA -"]
[]
["ba SOCIEDAD",{"$f":"$D$4","v":0},{"$f":"$D$4","v":0},"DIRECCION SEDE SOCIAL:",null,{"$f":"+IF(E30=0,\"CAMPO OBLIGATORIO, CAUSAL DE RECHAZO\",\"\")","v":"CAMPO OBLIGATORIO, CAUSAL DE RECHAZO"}]
["bb SOCIEDAD",{"$f":"IF(E31=0,0,$D$4)","v":0},{"$f":"IF(E31=0,0,$D$4)","v":0},"CUIT –sin puntos ni barras-:"]
["e CAP. SUSCR. TOT",{"$f":"$D$4","v":0},0,"CAPITAL SOCIAL(SUSCRIPTO):",null,{"$f":"+IF(E32=0,\"CAMPO OBLIGATORIO, CAUSAL DE RECHAZO\",\"\")","v":"CAMPO OBLIGATORIO, CAUSAL DE RECHAZO"}]
["h CAP. INTEG. TOT FORM.",0,0,"CAPITAL MÍNIMO A INTEGRAR TOTAL (SOCIOS DE ESTE FORM):",{"$f":"+SOCIOS!E33+SOCIOS!E55+SOCIOS!E77+SOCIOS!E99+SOCIOS!E121+SOCIOS!E143+SOCIOS!E165+SOCIOS!E187+SOCIOS!E209+SOCIOS!E231+SOCIOS!E253+SOCIOS!E275+SOCIOS!E297+SOCIOS!E319+SOCIOS!J30+SOCIOS!J47+SOCIOS!J64+SOCIOS!J81+SOCIOS!J98+SOCIOS!J115+SOCIOS!J132+SOCIOS!J149+SOCIOS!J166+SOCIOS!J183","v":0},{"$f":"+IF(E33=0,\"CAMPO OBLIGATORIO, CAUSAL DE RECHAZO\",\"\")","v":"CAMPO OBLIGATORIO, CAUSAL DE RECHAZO"}]
["d CANT. ACC. TOT.",0,0,"TOTAL ACCIONES:",{"$f":"E32","v":0}]
["b SOCIEDAD",0,0,"CEL/TEL (de administración) -en su caso indicar que no posee-:",null,{"$f":"+IF(E35=0,\"CAMPO OBLIGATORIO, CAUSAL DE RECHAZO\",\"\")","v":"CAMPO OBLIGATORIO, CAUSAL DE RECHAZO"}]
["b SOCIEDAD",0,0,"EMAIL (de administración)  -en su caso indicar que no posee-:",null,"CAMPO OBLIGATORIO, CAUSAL DE RECHAZO"]

{"sheet":"SOCIOS","index":2,"n_rows":323,"n_cols":10,"rows_kept":323,"cut":false,"hidden":false,"merged":[[7,8,7,10],[8,8,8,10],[9,9,9,10],[1,0,1,4],[2,0,2,4],[3,0,3,2],[3,3,3,4],[6,8,6,9],[6,0,8,0],[6,6,8,6],[5,0,5,4],[5,6,5,9]]}
[{"$f":"+'SOLICITUD-DATOS SOC'!A1","v":"DATOS SOCIALES "}]
["(COMPLETAR CELDAS CON FONDO VERDE)"]
["Unidad de Registro Publico y Contralor de Personas Jurídicas Río Gallegos Av. San Martin N° 2034 - Río Gallegos "]
["NOMBRE DE LA SOCIEDAD:",null,null,{"$f":"+'SOLICITUD-DATOS SOC'!D4:E4","v":0}]
[null,"FECHA:",{"$f":"+'SOLICITUD-DATOS SOC'!D5","v":"00:00:00"}]
["DATOS SOCIOS PERSONAS HUMANAS (si no alcanza llenar excedente en Form SAS 5)",null,null,null,null,null,"DATOS SOCIOS PERSONAS JURÍDICAS (si no alcanza llenar excedente en Form SAS 5)"]
["REFER.","APELLIDO/s DEL SOCIO","NOMBRE/s DEL SOCIO","DATOS",null,null,"REFER.","RAZON SOCIAL/DENOMINACIÓN SOCIO PERSONA JURÍDICA","DATOS"]
[]
[]
[null,null,null,null,null,null,null,null,null,"XX SA"]
[]
[]
[null,null,null,null,"COMPLETAR"]
[null,null,null,"CONCEPTO"]
[null,null,null,null,"-EN MAYUSCULA -"]
["c SOCIO PH",null,0,"DOC. IDENTIDAD –sin puntos-:",null,null,"c SOCIO PJ",null,"CUIT –sin puntos ni barras-:"]
["c SOCIO PH",{"$f":"+B16","v":0},{"$f":"+C16","v":0},"CUIT/CUIL –sin puntos ni barras-:",null,null,"c SOCIO PJ",{"$f":"H16","v":0},"TIPO DE PERSONA JCA -sociedad, asociación, mutual, etc-:"]
["c SOCIO PH",{"$f":"+B17","v":0},{"$f":"+C17","v":0},"FECHA DE NACIMIENTO –dd/mm/aa-:",null,null,"c SOCIO PJ",{"$f":"H16","v":0},"ORGANISMO /s DONDE SE INSCRIBIÓ CONSTITUCIÓN (INDICAR LOCALIDAD/PCIA DEL ORG) -si no se inscribió poner: NO INSCRIPTO/A:"]
["c SOCIO PH",0,0,"LUGAR DE NACIMIENTO:",null,null,"c SOCIO PJ",{"$f":"IF(I19=\"\",0,H16)","v":0},{"$f":"IF(OR(J18=\"NO INSCRIPTO/A\",J18=\"NO INSCR.\", J18=\"NO INSCR\",J18=\"N/I\", J18= \"NO INSCRIPTO\",J18=\"NO INSCRIPTA\"),\"\",\"DATOS DE RESOLUCIÓN Y FECHA DE INSCRIPCIÓN:\")","v":"DATOS DE RESOLUCIÓN Y FECHA DE INSCRIPCIÓN:"}]
["c SOCIO PH",0,0,"NACIONALIDAD:",null,null,"c SOCIO PJ",{"$f":"IF(I20=\"\",0,H16)","v":0},{"$f":"IF(I19=\"\",\"\",\"FECHA DE INSCRIPCION:\")","v":"FECHA DE INSCRIPCION:"}]
["c SOCIO PH",0,0,"PROFESIÓN/OFICIO:",null,null,"c SOCIO PJ",{"$f":"H16","v":0},"APELLIDO/S, NOMBRE/S,  DNI Y CARGO DE CADA MIEMBRO DE SU ADMINISTRACIÓN:"]
["c SOCIO PH",0,0,"DOMICILIO REAL:",null,null,"c SOCIO PJ",{"$f":"IF(AND(J23>0,J22=0),0,H16)","v":0},"DOMICILIO SOCIAL:"]
["c SOCIO PH",0,0,"CEL/TEL :",null,null,"c SOCIO PJ",{"$f":"IF(AND(J22>0,J23=0),0,H16)","v":0},"SEDE SOCIAL:"]
["c SOCIO PH",{"$f":"IF(E24=0,0,B16)","v":0},{"$f":"IF(E24=0,0,C16)","v":0},"EMAIL:",null,null,"c SOCIO PJ",{"$f":"H16","v":0},"CEL/TEL :"]
["c SOCIO PH",{"$f":"B16","v":0},{"$f":"C16","v":0},"ESTADO CIVIL:",null,null,"c SOCIO PJ",{"$f":"H16","v":0},"OBJETO PRINCIPAL (EN FORMA RESUMIDA):"]
["c SOCIO PH",{"$f":"IF($E25=\"CASADO/A\",B16,0)","v":0},{"$f":"IF($E25=\"CASADO/A\",C16,0)","v":0},{"$f":"IF(E25=\"CASADO/A\",\"APELLIDO/S CÓNYUGE:\",\"\")","v":""},null,null,"d CANT. ACC.",{"$f":"+H16","v":0},"NROS DE ACCIONES TITULAR:"]
["c SOCIO PH",{"$f":"IF($E25=\"CASADO/A\",B16,0)","v":0},{"$f":"IF($E25=\"CASADO/A\",C16,0)","v":0},{"$f":"IF(E25=\"CASADO/A\",\"NOMBRE/S CÓNYUGE:\",\"\")","v":""},null,null,"g AP. DINERO",{"$f":"+IF(J27=0,0,H16)","v":0},"APORTE EN DINERO:"]
["c SOCIO PH",{"$f":"IF($E25=\"CASADO/A\",B16,0)","v":0},{"$f":"IF($E25=\"CASADO/A\",C16,0)","v":0},{"$f":"IF(E25=\"CASADO/A\",\"DOC. IDENTIDAD (cónyuge) –sin puntos ni barras-:\",\"\")","v":""},null,null,"g AP. ESPECIE",{"$f":"+IF(J28=0,0,H16)","v":0},"APORTE EN ESPECIE (BS. NO DINERARIOS):",0]
["d CANT. ACC.",{"$f":"+B16","v":0},{"$f":"+C16","v":0},"NROS DE ACCIONES TITULAR:",null,null,"e CAP. SUSCR.",{"$f":"+H16","v":0},"CAPITAL SUSCRIPTO:",{"$f":"J27+J28","v":0}]
["g AP. DINERO",{"$f":"IF(AND($E31>0,$E30=0),0,B16)","v":0},{"$f":"IF(AND($E31>0,$E30=0),0,C16)","v":0},"APORTE EN DINERO:",null,null,"h CAP. INTEG.",{"$f":"+H16","v":0},"CAPITAL A INTEGRAR (MÍNIMO):",{"$f":"+J27*0.25+J28","v":0}]
["g AP. ESPECIE",{"$f":"IF(AND($E30>0,$E31=0),0,B16)","v":0},{"$f":"IF(AND($E30>0,$E31=0),0,C16)","v":0},"APORTE EN ESPECIE (BS. NO DINERARIOS):",null,null,"f PARTICIPACION",{"$f":"+H16","v":0},"PARTICIPACIÓN S/CAPITAL (%):",{"$f":"+J29/'SOLICITUD-DATOS SOC'!$E$32","v":{"$error":"#DIV/0!"}}]
["e CAP. SUSCR.",{"$f":"+B25","v":0},{"$f":"+C25","v":0},"CAPITAL SUSCRIPTO:",{"$f":"E30+E31","v":0},null,"c SOCIO PJ",{"$f":"IF(J32=0,0,H16)","v":0},"NOTA/OBSERVACIÓN -en mayúscula-:"]
["h CAP. INTEG.",{"$f":"+B16","v":0},{"$f":"+C16","v":0},"CAPITAL A INTEGRAR (MÍNIMO):",{"$f":"+E30*0.25+E31","v":0},null,"c SOCIO PJ",null,"CUIT –sin puntos ni barras-:"]
["f PARTICIPACION",{"$f":"+B16","v":0},{"$f":"+C16","v":0},"PARTICIPACIÓN S/CAPITAL (%):",{"$f":"+E32/'SOLICITUD-DATOS SOC'!$E$32","v":{"$error":"#DIV/0!"}},null,"c SOCIO PJ",{"$f":"H33","v":0},"TIPO DE PERSONA JCA -sociedad, asociación, mutual, etc-:"]
["i ORG. REP. LEGAL/ ADM.",{"$f":"IF(E35=0,0,B16)","v":0},{"$f":"IF(E35=0,0,C16)","v":0},"NOMBRE CARGO REP. LEGAL/ ADMINISTRACIÓN QUE OCUPA:",null,null,"c SOCIO PJ",{"$f":"H33","v":0},"ORGANISMO /s DONDE SE INSCRIBIÓ CONSTITUCIÓN (INDICAR LOCALIDAD/PCIA DEL ORG) -si no se inscribió poner: NO INSCRIPTO/A:"]
["j ORG. FISCALIZ.",{"$f":"IF(OR(E36=0,E36=\"PRESCINDE ART. 9 ACTO CONSTITUIVO\"),0,B16)","v":0},{"$f":"IF(OR(F37=0,E36=\"PRESCINDE ART.9 ACTO CONSTITUIVO\"),0,C16)","v":0},"NOMBRE CARGO FISCALIZACIÓN QUE OCUPA:",null,null,"c SOCIO PJ",{"$f":"IF(I36=\"\",0,H33)","v":0},{"$f":"IF(OR(J35=\"NO INSCRIPTO/A\",J35=\"NO INSCR.\", J35=\"NO INSCR\",J35=\"N/I\", J35= \"NO INSCRIPTO\",J35=\"NO INSCRIPTA\"),\"\",\"DATOS DE RESOLUCIÓN Y FECHA DE INSCRIPCIÓN:\")","v":"DATOS DE RESOLUCIÓN Y FECHA DE INSCRIPCIÓN:"}]
["c SOCIO PH",{"$f":"IF(E37=0,0,B16)","v":0},{"$f":"IF(E37=0,0,C16)","v":0},"NOTA/OBSERVACIÓN -en mayúscula-:",null,null,"c SOCIO PJ",{"$f":"IF(I37=\"\",0,H33)","v":0},{"$f":"IF(I36=\"\",\"\",\"FECHA DE INSCRIPCION:\")","v":"FECHA DE INSCRIPCION:"}]
["c SOCIO PH",null,null,"DOC. IDENTIDAD –sin puntos-:",null,null,"c SOCIO PJ",{"$f":"H33","v":0},"APELLIDO/S, NOMBRE/S,  DNI Y CARGO DE CADA MIEMBRO DE SU ADMINISTRACIÓN:"]
["c SOCIO PH",{"$f":"+B38","v":0},{"$f":"+C38","v":0},"CUIT/CUIL –sin puntos ni barras-:",null,null,"c SOCIO PJ",{"$f":"IF(AND(J40>0,J39=0),0,H33)","v":0},"DOMICILIO SOCIAL:"]
["c SOCIO PH",{"$f":"+B39","v":0},0,"FECHA DE NACIMIENTO –dd/mm/aa-:",null,null,"c SOCIO PJ",{"$f":"IF(AND(J39>0,J40=0),0,H33)","v":0},"SEDE SOCIAL:"]
["c SOCIO PH",0,0,"LUGAR DE NACIMIENTO:",null,null,"c SOCIO PJ",{"$f":"H33","v":0},"CEL/TEL :"]
["c SOCIO PH",0,0,"NACIONALIDAD:",null,null,"c SOCIO PJ",{"$f":"H33","v":0},"OBJETO PRINCIPAL (EN FORMA RESUMIDA):"]
["c SOCIO PH",0,0,"PROFESIÓN/OFICIO:",null,null,"d CANT. ACC.",{"$f":"+H33","v":0},"NROS DE ACCIONES TITULAR:"]
["c SOCIO PH",0,0,"DOMICILIO REAL:",null,null,"g AP. DINERO",{"$f":"+IF(J44=0,0,H33)","v":0},"APORTE EN DINERO:"]
["c SOCIO PH",0,0,"CEL/TEL :",null,null,"g AP. ESPECIE",{"$f":"+IF(J45=0,0,H33)","v":0},"APORTE EN ESPECIE (BS. NO DINERARIOS):",0]
["c SOCIO PH",{"$f":"IF(E46=0,0,B38)","v":0},{"$f":"IF(E46=0,0,C38)","v":0},"EMAIL:",null,null,"e CAP. SUSCR.",{"$f":"+H33","v":0},"CAPITAL SUSCRIPTO:",{"$f":"J44+J45","v":0}]
["c SOCIO PH",{"$f":"B38","v":0},{"$f":"C38","v":0},"ESTADO CIVIL:",null,null,"h CAP. INTEG.",{"$f":"+H33","v":0},"CAPITAL A INTEGRAR (MÍNIMO):",{"$f":"+J44*0.25+J45","v":0}]
["c SOCIO PH",{"$f":"IF($E47=\"CASADO/A\",B38,0)","v":0},{"$f":"IF($E47=\"CASADO/A\",C38,0)","v":0},{"$f":"IF(E47=\"CASADO/A\",\"APELLIDO/S CÓNYUGE:\",\"\")","v":""},null,null,"f PARTICIPACION",{"$f":"+H33","v":0},"PARTICIPACIÓN S/CAPITAL (%):",{"$f":"+J46/'SOLICITUD-DATOS SOC'!$E$32","v":{"$error":"#DIV/0!"}}]
["c SOCIO PH",{"$f":"IF($E47=\"CASADO/A\",B38,0)","v":0},{"$f":"IF($E47=\"CASADO/A\",C38,0)","v":0},{"$f":"IF(E47=\"CASADO/A\",\"NOMBRE/S CÓNYUGE:\",\"\")","v":""},null,null,"c SOCIO PJ",{"$f":"IF(J49=0,0,H33)","v":0},"NOTA/OBSERVACIÓN -en mayúscula-:"]
["c SOCIO PH",{"$f":"IF($E47=\"CASADO/A\",B38,0)","v":0},{"$f":"IF($E47=\"CASADO/A\",C38,0)","v":0},{"$f":"IF(E47=\"CASADO/A\",\"DOC. IDENTIDAD (cónyuge) –sin puntos ni barras-:\",\"\")","v":""},null,null,"c SOCIO PJ",null,"CUIT –sin puntos ni barras-:"]
["d CANT. ACC.",{"$f":"+B38","v":0},{"$f":"+C38","v":0},"NROS DE ACCIONES TITULAR:",null,null,"c SOCIO PJ",{"$f":"H50","v":0},"TIPO DE PERSONA JCA -sociedad, asociación, mutual, etc-:"]
["g AP. DINERO",{"$f":"IF(AND($E53>0,$E52=0),0,B38)","v":0},{"$f":"IF(AND($E53>0,$E52=0),0,C38)","v":0},"APORTE EN DINERO:",null,null,"c SOCIO PJ",{"$f":"H50","v":0},"ORGANISMO /s DONDE SE INSCRIBIÓ CONSTITUCIÓN (INDICAR LOCALIDAD/PCIA DEL ORG) -si no se inscribió poner: NO INSCRIPTO/A:"]
["g AP. ESPECIE",{"$f":"IF(AND($E52>0,$E53=0),0,B38)","v":0},{"$f":"IF(AND($E52>0,$E53=0),0,C38)","v":0},"APORTE EN ESPECIE (BS. NO DINERARIOS):",null,null,"c SOCIO PJ",{"$f":"IF(I53=\"\",0,H50)","v":0},{"$f":"IF(OR(J52=\"NO INSCRIPTO/A\",J52=\"NO INSCR.\", J52=\"NO INSCR\",J52=\"N/I\", J52= \"NO INSCRIPTO\",J52=\"NO INSCRIPTA\"),\"\",\"DATOS DE RESOLUCIÓN Y FECHA DE INSCRIPCIÓN:\")","v":"DATOS DE RESOLUCIÓN Y FECHA DE INSCRIPCIÓN:"}]
["e CAP. SUSCR.",{"$f":"+B47","v":0},{"$f":"+C47","v":0},"CAPITAL SUSCRIPTO:",{"$f":"E52+E53","v":0},null,"c SOCIO PJ",{"$f":"IF(I54=\"\",0,H50)","v":0},{"$f":"IF(I53=\"\",\"\",\"FECHA DE INSCRIPCION:\")","v":"FECHA DE INSCRIPCION:"}]
["h CAP. INTEG.",{"$f":"+B38","v":0},{"$f":"+C38","v":0},"CAPITAL A INTEGRAR (MÍNIMO):",{"$f":"+E52*0.25+E53","v":0},null,"c SOCIO PJ",{"$f":"H50","v":0},"APELLIDO/S, NOMBRE/S,  DNI Y CARGO DE CADA MIEMBRO DE SU ADMINISTRACIÓN:"]
["f PARTICIPACION",{"$f":"+B38","v":0},{"$f":"+C38","v":0},"PARTICIPACIÓN S/CAPITAL (%):",{"$f":"+E54/'SOLICITUD-DATOS SOC'!$E$32","v":{"$error":"#DIV/0!"}},null,"c SOCIO PJ",{"$f":"IF(AND(J57>0,J56=0),0,H50)","v":0},"DOMICILIO SOCIAL:"]
["i ORG. REP. LEGAL/ ADM.",{"$f":"IF(E57=0,0,B38)","v":0},{"$f":"IF(E57=0,0,C38)","v":0},"NOMBRE CARGO REP. LEGAL/ ADMINISTRACIÓN QUE OCUPA:",null,null,"c SOCIO PJ",{"$f":"IF(AND(J56>0,J57=0),0,H50)","v":0},"SEDE SOCIAL:"]
["j ORG. FISCALIZ.",{"$f":"IF(OR(E58=0,E58=\"PRESCINDE ART. 9 ACTO CONSTITUIVO\"),0,B38)","v":0},{"$f":"IF(OR(F59=0,E58=\"PRESCINDE ART.9 ACTO CONSTITUIVO\"),0,C38)","v":0},"NOMBRE CARGO FISCALIZACIÓN QUE OCUPA:",null,null,"c SOCIO PJ",{"$f":"H50","v":0},"CEL/TEL :"]
["c SOCIO PH",{"$f":"IF(E59=0,0,B38)","v":0},{"$f":"IF(E59=0,0,C38)","v":0},"NOTA/OBSERVACIÓN -en mayúscula-:",null,null,"c SOCIO PJ",{"$f":"H50","v":0},"OBJETO PRINCIPAL (EN FORMA RESUMIDA):"]
["c SOCIO PH",0,null,"DOC. IDENTIDAD –sin puntos-:",null,null,"d CANT. ACC.",{"$f":"+H50","v":0},"NROS DE ACCIONES TITULAR:"]
["c SOCIO PH",{"$f":"+B60","v":0},{"$f":"+C60","v":0},"CUIT/CUIL –sin puntos ni barras-:",null,null,"g AP. DINERO",{"$f":"+IF(J61=0,0,H50)","v":0},"APORTE EN DINERO:"]
["c SOCIO PH",{"$f":"+B61","v":0},0,"FECHA DE NACIMIENTO –dd/mm/aa-:",null,null,"g AP. ESPECIE",{"$f":"+IF(J62=0,0,H50)","v":0},"APORTE EN ESPECIE (BS. NO DINERARIOS):",0]
["c SOCIO PH",0,0,"LUGAR DE NACIMIENTO:",null,null,"e CAP. SUSCR.",{"$f":"+H50","v":0},"CAPITAL SUSCRIPTO:",{"$f":"J61+J62","v":0}]
["c SOCIO PH",0,0,"NACIONALIDAD:",null,null,"h CAP. INTEG.",{"$f":"+H50","v":0},"CAPITAL A INTEGRAR (MÍNIMO):",{"$f":"+J61*0.25+J62","v":0}]
["c SOCIO PH",0,0,"PROFESIÓN/OFICIO:",null,null,"f PARTICIPACION",{"$f":"+H50","v":0},"PARTICIPACIÓN S/CAPITAL (%):",{"$f":"+J63/'SOLICITUD-DATOS SOC'!$E$32","v":{"$error":"#DIV/0!"}}]
["c SOCIO PH",0,0,"DOMICILIO REAL:",null,null,"c SOCIO PJ",{"$f":"IF(J66=0,0,H50)","v":0},"NOTA/OBSERVACIÓN -en mayúscula-:"]
["c SOCIO PH",0,0,"CEL/TEL :",null,null,"c SOCIO PJ",null,"CUIT –sin puntos ni barras-:"]
["c SOCIO PH",{"$f":"IF(E68=0,0,B60)","v":0},{"$f":"IF(E68=0,0,C60)","v":0},"EMAIL:",null,null,"c SOCIO PJ",{"$f":"H67","v":0},"TIPO DE PERSONA JCA -sociedad, asociación, mutual, etc-:"]
["c SOCIO PH",{"$f":"B60","v":0},{"$f":"C60","v":0},"ESTADO CIVIL:",null,null,"c SOCIO PJ",{"$f":"H67","v":0},"ORGANISMO /s DONDE SE INSCRIBIÓ CONSTITUCIÓN (INDICAR LOCALIDAD/PCIA DEL ORG) -si no se inscribió poner: NO INSCRIPTO/A:"]
["c SOCIO PH",{"$f":"IF($E69=\"CASADO/A\",B60,0)","v":0},{"$f":"IF($E69=\"CASADO/A\",C60,0)","v":0},{"$f":"IF(E69=\"CASADO/A\",\"APELLIDO/S CÓNYUGE:\",\"\")","v":""},null,null,"c SOCIO PJ",{"$f":"IF(I70=\"\",0,H67)","v":0},{"$f":"IF(OR(J69=\"NO INSCRIPTO/A\",J69=\"NO INSCR.\", J69=\"NO INSCR\",J69=\"N/I\", J69= \"NO INSCRIPTO\",J69=\"NO INSCRIPTA\"),\"\",\"DATOS DE RESOLUCIÓN Y FECHA DE INSCRIPCIÓN:\")","v":"DATOS DE RESOLUCIÓN Y FECHA DE INSCRIPCIÓN:"}]
["c SOCIO PH",{"$f":"IF($E69=\"CASADO/A\",B60,0)","v":0},{"$f":"IF($E69=\"CASADO/A\",C60,0)","v":0},{"$f":"IF(E69=\"CASADO/A\",\"NOMBRE/S CÓNYUGE:\",\"\")","v":""},null,null,"c SOCIO PJ",{"$f":"IF(I71=\"\",0,H67)","v":0},{"$f":"IF(I70=\"\",\"\",\"FECHA DE INSCRIPCION:\")","v":"FECHA DE INSCRIPCION:"}]
["c SOCIO PH",{"$f":"IF($E69=\"CASADO/A\",B60,0)","v":0},{"$f":"IF($E69=\"CASADO/A\",C60,0)","v":0},{"$f":"IF(E69=\"CASADO/A\",\"DOC. IDENTIDAD (cónyuge) –sin puntos ni barras-:\",\"\")","v":""},null,null,"c SOCIO PJ",{"$f":"H67","v":0},"APELLIDO/S, NOMBRE/S,  DNI Y CARGO DE CADA MIEMBRO DE SU ADMINISTRACIÓN:"]
["d CANT. ACC.",{"$f":"+B60","v":0},{"$f":"+C60","v":0},"NROS DE ACCIONES TITULAR:",null,null,"c SOCIO PJ",{"$f":"IF(AND(J74>0,J73=0),0,H67)","v":0},"DOMICILIO SOCIAL:"]
["g AP. DINERO",{"$f":"IF(AND($E75>0,$E74=0),0,B60)","v":0},{"$f":"IF(AND($E75>0,$E74=0),0,C60)","v":0},"APORTE EN DINERO:",null,null,"c SOCIO PJ",{"$f":"IF(AND(J73>0,J74=0),0,H67)","v":0},"SEDE SOCIAL:"]
["g AP. ESPECIE",{"$f":"IF(AND($E74>0,$E75=0),0,B60)","v":0},{"$f":"IF(AND($E74>0,$E75=0),0,C60)","v":0},"APORTE EN ESPECIE (BS. NO DINERARIOS):",null,null,"c SOCIO PJ",{"$f":"H67","v":0},"CEL/TEL :"]
["e CAP. SUSCR.",{"$f":"+B69","v":0},{"$f":"+C69","v":0},"CAPITAL SUSCRIPTO:",{"$f":"E74+E75","v":0},null,"c SOCIO PJ",{"$f":"H67","v":0},"OBJETO PRINCIPAL (EN FORMA RESUMIDA):"]
["h CAP. INTEG.",{"$f":"+B60","v":0},{"$f":"+C60","v":0},"CAPITAL A INTEGRAR (MÍNIMO):",{"$f":"+E74*0.25+E75","v":0},null,"d CANT. ACC.",{"$f":"+H67","v":0},"NROS DE ACCIONES TITULAR:"]
["f PARTICIPACION",{"$f":"+B60","v":0},{"$f":"+C60","v":0},"PARTICIPACIÓN S/CAPITAL (%):",{"$f":"+E76/'SOLICITUD-DATOS SOC'!$E$32","v":{"$error":"#DIV/0!"}},null,"g AP. DINERO",{"$f":"+IF(J78=0,0,H67)","v":0},"APORTE EN DINERO:"]
["i ORG. REP. LEGAL/ ADM.",{"$f":"IF(E79=0,0,B60)","v":0},{"$f":"IF(E79=0,0,C60)","v":0},"NOMBRE CARGO REP. LEGAL/ ADMINISTRACIÓN QUE OCUPA:",null,null,"g AP. ESPECIE",{"$f":"+IF(J79=0,0,H67)","v":0},"APORTE EN ESPECIE (BS. NO DINERARIOS):",0]
["j ORG. FISCALIZ.",{"$f":"IF(OR(E80=0,E80=\"PRESCINDE ART. 9 ACTO CONSTITUIVO\"),0,B60)","v":0},{"$f":"IF(OR(F81=0,E80=\"PRESCINDE ART.9 ACTO CONSTITUIVO\"),0,C60)","v":0},"NOMBRE CARGO FISCALIZACIÓN QUE OCUPA:",null,null,"e CAP. SUSCR.",{"$f":"+H67","v":0},"CAPITAL SUSCRIPTO:",{"$f":"J78+J79","v":0}]
["c SOCIO PH",{"$f":"IF(E81=0,0,B60)","v":0},{"$f":"IF(E81=0,0,C60)","v":0},"NOTA/OBSERVACIÓN -en mayúscula-:",null,null,"h CAP. INTEG.",{"$f":"+H67","v":0},"CAPITAL A INTEGRAR (MÍNIMO):",{"$f":"+J78*0.25+J79","v":0}]
["c SOCIO PH",0,null,"DOC. IDENTIDAD –sin puntos-:",null,null,"f PARTICIPACION",{"$f":"+H67","v":0},"PARTICIPACIÓN S/CAPITAL (%):",{"$f":"+J80/'SOLICITUD-DATOS SOC'!$E$32","v":{"$error":"#DIV/0!"}}]
["c SOCIO PH",{"$f":"+B82","v":0},{"$f":"+C82","v":0},"CUIT/CUIL –sin puntos ni barras-:",null,null,"c SOCIO PJ",{"$f":"IF(J83=0,0,H67)","v":0},"NOTA/OBSERVACIÓN -en mayúscula-:"]
["c SOCIO PH",{"$f":"+B83","v":0},0,"FECHA DE NACIMIENTO –dd/mm/aa-:",null,null,"c SOCIO PJ",null,"CUIT –sin puntos ni barras-:"]
["c SOCIO PH",0,0,"LUGAR DE NACIMIENTO:",null,null,"c SOCIO PJ",{"$f":"H84","v":0},"TIPO DE PERSONA JCA -sociedad, asociación, mutual, etc-:"]
["c SOCIO PH",0,0,"NACIONALIDAD:",null,null,"c SOCIO PJ",{"$f":"H84","v":0},"ORGANISMO /s DONDE SE INSCRIBIÓ CONSTITUCIÓN (INDICAR LOCALIDAD/PCIA DEL ORG) -si no se inscribió poner: NO INSCRIPTO/A:"]
["c SOCIO PH",0,0,"PROFESIÓN/OFICIO:",null,null,"c SOCIO PJ",{"$f":"IF(I87=\"\",0,H84)","v":0},{"$f":"IF(OR(J86=\"NO INSCRIPTO/A\",J86=\"NO INSCR.\", J86=\"NO INSCR\",J86=\"N/I\", J86= \"NO INSCRIPTO\",J86=\"NO INSCRIPTA\"),\"\",\"DATOS DE RESOLUCIÓN Y FECHA DE INSCRIPCIÓN:\")","v":"DATOS DE RESOLUCIÓN Y FECHA DE INSCRIPCIÓN:"}]
["c SOCIO PH",0,0,"DOMICILIO REAL:",null,null,"c SOCIO PJ",{"$f":"IF(I88=\"\",0,H84)","v":0},{"$f":"IF(I87=\"\",\"\",\"FECHA DE INSCRIPCION:\")","v":"FECHA DE INSCRIPCION:"}]
["c SOCIO PH",0,0,"CEL/TEL :",null,null,"c SOCIO PJ",{"$f":"H84","v":0},"APELLIDO/S, NOMBRE/S,  DNI Y CARGO DE CADA MIEMBRO DE SU ADMINISTRACIÓN:"]
["c SOCIO PH",{"$f":"IF(E90=0,0,B82)","v":0},{"$f":"IF(E90=0,0,C82)","v":0},"EMAIL:",null,null,"c SOCIO PJ",{"$f":"IF(AND(J91>0,J90=0),0,H84)","v":0},"DOMICILIO SOCIAL:"]
["c SOCIO PH",{"$f":"B82","v":0},{"$f":"C82","v":0},"ESTADO CIVIL:",null,null,"c SOCIO PJ",{"$f":"IF(AND(J90>0,J91=0),0,H84)","v":0},"SEDE SOCIAL:"]
["c SOCIO PH",{"$f":"IF($E91=\"CASADO/A\",B82,0)","v":0},{"$f":"IF($E91=\"CASADO/A\",C82,0)","v":0},{"$f":"IF(E91=\"CASADO/A\",\"APELLIDO/S CÓNYUGE:\",\"\")","v":""},null,null,"c SOCIO PJ",{"$f":"H84","v":0},"CEL/TEL :"]
["c SOCIO PH",{"$f":"IF($E91=\"CASADO/A\",B82,0)","v":0},{"$f":"IF($E91=\"CASADO/A\",C82,0)","v":0},{"$f":"IF(E91=\"CASADO/A\",\"NOMBRE/S CÓNYUGE:\",\"\")","v":""},null,null,"c SOCIO PJ",{"$f":"H84","v":0},"OBJETO PRINCIPAL (EN FORMA RESUMIDA):"]
["c SOCIO PH",{"$f":"IF($E91=\"CASADO/A\",B82,0)","v":0},{"$f":"IF($E91=\"CASADO/A\",C82,0)","v":0},{"$f":"IF(E91=\"CASADO/A\",\"DOC. IDENTIDAD (cónyuge) –sin puntos ni barras-:\",\"\")","v":""},null,null,"d CANT. ACC.",{"$f":"+H84","v":0},"NROS DE ACCIONES TITULAR:"]
["d CANT. ACC.",{"$f":"+B82","v":0},{"$f":"+C82","v":0},"NROS DE ACCIONES TITULAR:",null,null,"g AP. DINERO",{"$f":"+IF(J95=0,0,H84)","v":0},"APORTE EN DINERO:"]
["g AP. DINERO",{"$f":"IF(AND($E97>0,$E96=0),0,B82)","v":0},{"$f":"IF(AND($E97>0,$E96=0),0,C82)","v":0},"APORTE EN DINERO:",null,null,"g AP. ESPECIE",{"$f":"+IF(J96=0,0,H84)","v":0},"APORTE EN ESPECIE (BS. NO DINERARIOS):",0]
["g AP. ESPECIE",{"$f":"IF(AND($E96>0,$E97=0),0,B82)","v":0},{"$f":"IF(AND($E96>0,$E97=0),0,C82)","v":0},"APORTE EN ESPECIE (BS. NO DINERARIOS):",null,null,"e CAP. SUSCR.",{"$f":"+H84","v":0},"CAPITAL SUSCRIPTO:",{"$f":"J95+J96","v":0}]
["e CAP. SUSCR.",{"$f":"+B91","v":0},{"$f":"+C91","v":0},"CAPITAL SUSCRIPTO:",{"$f":"E96+E97","v":0},null,"h CAP. INTEG.",{"$f":"+H84","v":0},"CAPITAL A INTEGRAR (MÍNIMO):",{"$f":"+J95*0.25+J96","v":0}]
["h CAP. INTEG.",{"$f":"+B82","v":0},{"$f":"+C82","v":0},"CAPITAL A INTEGRAR (MÍNIMO):",{"$f":"+E96*0.25+E97","v":0},null,"f PARTICIPACION",{"$f":"+H84","v":0},"PARTICIPACIÓN S/CAPITAL (%):",{"$f":"+J97/'SOLICITUD-DATOS SOC'!$E$32","v":{"$error":"#DIV/0!"}}]
["f PARTICIPACION",{"$f":"+B82","v":0},{"$f":"+C82","v":0},"PARTICIPACIÓN S/CAPITAL (%):",{"$f":"+E98/'SOLICITUD-DATOS SOC'!$E$32","v":{"$error":"#DIV/0!"}},null,"c SOCIO PJ",{"$f":"IF(J100=0,0,H84)","v":0},"NOTA/OBSERVACIÓN -en mayúscula-:"]
["i ORG. REP. LEGAL/ ADM.",{"$f":"IF(E101=0,0,B82)","v":0},{"$f":"IF(E101=0,0,C82)","v":0},"NOMBRE CARGO REP. LEGAL/ ADMINISTRACIÓN QUE OCUPA:",null,null,"c SOCIO PJ",null,"CUIT –sin puntos ni barras-:"]
["j ORG. FISCALIZ.",{"$f":"IF(OR(E102=0,E102=\"PRESCINDE ART. 9 ACTO CONSTITUIVO\"),0,B82)","v":0},{"$f":"IF(OR(F103=0,E102=\"PRESCINDE ART.9 ACTO CONSTITUIVO\"),0,C82)","v":0},"NOMBRE CARGO FISCALIZACIÓN QUE OCUPA:",null,null,"c SOCIO PJ",{"$f":"H101","v":0},"TIPO DE PERSONA JCA -sociedad, asociación, mutual, etc-:"]
["c SOCIO PH",{"$f":"IF(E103=0,0,B82)","v":0},{"$f":"IF(E103=0,0,C82)","v":0},"NOTA/OBSERVACIÓN -en mayúscula-:",null,null,"c SOCIO PJ",{"$f":"H101","v":0},"ORGANISMO /s DONDE SE INSCRIBIÓ CONSTITUCIÓN (INDICAR LOCALIDAD/PCIA DEL ORG) -si no se inscribió poner: NO INSCRIPTO/A:"]
["c SOCIO PH",0,null,"DOC. IDENTIDAD –sin puntos-:",null,null,"c SOCIO PJ",{"$f":"IF(I104=\"\",0,H101)","v":0},{"$f":"IF(OR(J103=\"NO INSCRIPTO/A\",J103=\"NO INSCR.\", J103=\"NO INSCR\",J103=\"N/I\", J103= \"NO INSCRIPTO\",J103=\"NO INSCRIPTA\"),\"\",\"DATOS DE RESOLUCIÓN Y FECHA DE INSCRIPCIÓN:\")","v":"DATOS DE RESOLUCIÓN Y FECHA DE INSCRIPCIÓN:"}]
["c SOCIO PH",{"$f":"+B104","v":0},{"$f":"+C104","v":0},"CUIT/CUIL –sin puntos ni barras-:",null,null,"c SOCIO PJ",{"$f":"IF(I105=\"\",0,H101)","v":0},{"$f":"IF(I104=\"\",\"\",\"FECHA DE INSCRIPCION:\")","v":"FECHA DE INSCRIPCION:"}]
["c SOCIO PH",{"$f":"+B105","v":0},0,"FECHA DE NACIMIENTO –dd/mm/aa-:",null,null,"c SOCIO PJ",{"$f":"H101","v":0},"APELLIDO/S, NOMBRE/S,  DNI Y CARGO DE CADA MIEMBRO DE SU ADMINISTRACIÓN:"]
["c SOCIO PH",0,0,"LUGAR DE NACIMIENTO:",null,null,"c SOCIO PJ",{"$f":"IF(AND(J108>0,J107=0),0,H101)","v":0},"DOMICILIO SOCIAL:"]
["c SOCIO PH",0,0,"NACIONALIDAD:",null,null,"c SOCIO PJ",{"$f":"IF(AND(J107>0,J108=0),0,H101)","v":0},"SEDE SOCIAL:"]
["c SOCIO PH",0,0,"PROFESIÓN/OFICIO:",null,null,"c SOCIO PJ",{"$f":"H101","v":0},"CEL/TEL :"]
["c SOCIO PH",0,0,"DOMICILIO REAL:",null,null,"c SOCIO PJ",{"$f":"H101","v":0},"OBJETO PRINCIPAL (EN FORMA RESUMIDA):"]
["c SOCIO PH",0,0,"CEL/TEL :",null,null,"d CANT. ACC.",{"$f":"+H101","v":0},"NROS DE ACCIONES TITULAR:"]
["c SOCIO PH",{"$f":"IF(E112=0,0,B104)","v":0},{"$f":"IF(E112=0,0,C104)","v":0},"EMAIL:",null,null,"g AP. DINERO",{"$f":"+IF(J112=0,0,H101)","v":0},"APORTE EN DINERO:"]
["c SOCIO PH",{"$f":"B104","v":0},{"$f":"C104","v":0},"ESTADO CIVIL:",null,null,"g AP. ESPECIE",{"$f":"+IF(J113=0,0,H101)","v":0},"APORTE EN ESPECIE (BS. NO DINERARIOS):",0]
["c SOCIO PH",{"$f":"IF($E113=\"CASADO/A\",B104,0)","v":0},{"$f":"IF($E113=\"CASADO/A\",C104,0)","v":0},{"$f":"IF(E113=\"CASADO/A\",\"APELLIDO/S CÓNYUGE:\",\"\")","v":""},null,null,"e CAP. SUSCR.",{"$f":"+H101","v":0},"CAPITAL SUSCRIPTO:",{"$f":"J112+J113","v":0}]
["c SOCIO PH",{"$f":"IF($E113=\"CASADO/A\",B104,0)","v":0},{"$f":"IF($E113=\"CASADO/A\",C104,0)","v":0},{"$f":"IF(E113=\"CASADO/A\",\"NOMBRE/S CÓNYUGE:\",\"\")","v":""},null,null,"h CAP. INTEG.",{"$f":"+H101","v":0},"CAPITAL A INTEGRAR (MÍNIMO):",{"$f":"+J112*0.25+J113","v":0}]
["c SOCIO PH",{"$f":"IF($E113=\"CASADO/A\",B104,0)","v":0},{"$f":"IF($E113=\"CASADO/A\",C104,0)","v":0},{"$f":"IF(E113=\"CASADO/A\",\"DOC. IDENTIDAD (cónyuge) –sin puntos ni barras-:\",\"\")","v":""},null,null,"f PARTICIPACION",{"$f":"+H101","v":0},"PARTICIPACIÓN S/CAPITAL (%):",{"$f":"+J114/'SOLICITUD-DATOS SOC'!$E$32","v":{"$error":"#DIV/0!"}}]
["d CANT. ACC.",{"$f":"+B104","v":0},{"$f":"+C104","v":0},"NROS DE ACCIONES TITULAR:",null,null,"c SOCIO PJ",{"$f":"IF(J117=0,0,H101)","v":0},"NOTA/OBSERVACIÓN -en mayúscula-:"]
["g AP. DINERO",{"$f":"IF(AND($E119>0,$E118=0),0,B104)","v":0},{"$f":"IF(AND($E119>0,$E118=0),0,C104)","v":0},"APORTE EN DINERO:",null,null,"c SOCIO PJ",null,"CUIT –sin puntos ni barras-:"]
["g AP. ESPECIE",{"$f":"IF(AND($E118>0,$E119=0),0,B104)","v":0},{"$f":"IF(AND($E118>0,$E119=0),0,C104)","v":0},"APORTE EN ESPECIE (BS. NO DINERARIOS):",null,null,"c SOCIO PJ",{"$f":"H118","v":0},"TIPO DE PERSONA JCA -sociedad, asociación, mutual, etc-:"]
["e CAP. SUSCR.",{"$f":"+B113","v":0},{"$f":"+C113","v":0},"CAPITAL SUSCRIPTO:",{"$f":"E118+E119","v":0},null,"c SOCIO PJ",{"$f":"H118","v":0},"ORGANISMO /s DONDE SE INSCRIBIÓ CONSTITUCIÓN (INDICAR LOCALIDAD/PCIA DEL ORG) -si no se inscribió poner: NO INSCRIPTO/A:"]
["h CAP. INTEG.",{"$f":"+B104","v":0},{"$f":"+C104","v":0},"CAPITAL A INTEGRAR (MÍNIMO):",{"$f":"+E118*0.25+E119","v":0},null,"c SOCIO PJ",{"$f":"IF(I121=\"\",0,H118)","v":0},{"$f":"IF(OR(J120=\"NO INSCRIPTO/A\",J120=\"NO INSCR.\", J120=\"NO INSCR\",J120=\"N/I\", J120= \"NO INSCRIPTO\",J120=\"NO INSCRIPTA\"),\"\",\"DATOS DE RESOLUCIÓN Y FECHA DE INSCRIPCIÓN:\")","v":"DATOS DE RESOLUCIÓN Y FECHA DE INSCRIPCIÓN:"}]
["f PARTICIPACION",{"$f":"+B104","v":0},{"$f":"+C104","v":0},"PARTICIPACIÓN S/CAPITAL (%):",{"$f":"+E120/'SOLICITUD-DATOS SOC'!$E$32","v":{"$error":"#DIV/0!"}},null,"c SOCIO PJ",{"$f":"IF(I122=\"\",0,H118)","v":0},{"$f":"IF(I121=\"\",\"\",\"FECHA DE INSCRIPCION:\")","v":"FECHA DE INSCRIPCION:"}]
["i ORG. REP. LEGAL/ ADM.",{"$f":"IF(E123=0,0,B104)","v":0},{"$f":"IF(E123=0,0,C104)","v":0},"NOMBRE CARGO REP. LEGAL/ ADMINISTRACIÓN QUE OCUPA:",null,null,"c SOCIO PJ",{"$f":"H118","v":0},"APELLIDO/S, NOMBRE/S,  DNI Y CARGO DE CADA MIEMBRO DE SU ADMINISTRACIÓN:"]
["j ORG. FISCALIZ.",{"$f":"IF(OR(E124=0,E124=\"PRESCINDE ART. 9 ACTO CONSTITUIVO\"),0,B104)","v":0},{"$f":"IF(OR(F125=0,E124=\"PRESCINDE ART.9 ACTO CONSTITUIVO\"),0,C104)","v":0},"NOMBRE CARGO FISCALIZACIÓN QUE OCUPA:",null,null,"c SOCIO PJ",{"$f":"IF(AND(J125>0,J124=0),0,H118)","v":0},"DOMICILIO SOCIAL:"]
["c SOCIO PH",{"$f":"IF(E125=0,0,B104)","v":0},{"$f":"IF(E125=0,0,C104)","v":0},"NOTA/OBSERVACIÓN -en mayúscula-:",null,null,"c SOCIO PJ",{"$f":"IF(AND(J124>0,J125=0),0,H118)","v":0},"SEDE SOCIAL:"]
["c SOCIO PH",0,null,"DOC. IDENTIDAD –sin puntos-:",null,null,"c SOCIO PJ",{"$f":"H118","v":0},"CEL/TEL :"]
["c SOCIO PH",{"$f":"+B126","v":0},{"$f":"+C126","v":0},"CUIT/CUIL –sin puntos ni barras-:",null,null,"c SOCIO PJ",{"$f":"H118","v":0},"OBJETO PRINCIPAL (EN FORMA RESUMIDA):"]
["c SOCIO PH",{"$f":"+B127","v":0},0,"FECHA DE NACIMIENTO –dd/mm/aa-:",null,null,"d CANT. ACC.",{"$f":"+H118","v":0},"NROS DE ACCIONES TITULAR:"]
["c SOCIO PH",0,0,"LUGAR DE NACIMIENTO:",null,null,"g AP. DINERO",{"$f":"+IF(J129=0,0,H118)","v":0},"APORTE EN DINERO:"]
["c SOCIO PH",0,0,"NACIONALIDAD:",null,null,"g AP. ESPECIE",{"$f":"+IF(J130=0,0,H118)","v":0},"APORTE EN ESPECIE (BS. NO DINERARIOS):",0]
["c SOCIO PH",0,0,"PROFESIÓN/OFICIO:",null,null,"e CAP. SUSCR.",{"$f":"+H118","v":0},"CAPITAL SUSCRIPTO:",{"$f":"J129+J130","v":0}]
["c SOCIO PH",0,0,"DOMICILIO REAL:",null,null,"h CAP. INTEG.",{"$f":"+H118","v":0},"CAPITAL A INTEGRAR (MÍNIMO):",{"$f":"+J129*0.25+J130","v":0}]
["c SOCIO PH",0,0,"CEL/TEL :",null,null,"f PARTICIPACION",{"$f":"+H118","v":0},"PARTICIPACIÓN S/CAPITAL (%):",{"$f":"+J131/'SOLICITUD-DATOS SOC'!$E$32","v":{"$error":"#DIV/0!"}}]
["c SOCIO PH",{"$f":"IF(E134=0,0,B126)","v":0},{"$f":"IF(E134=0,0,C126)","v":0},"EMAIL:",null,null,"c SOCIO PJ",{"$f":"IF(J134=0,0,H118)","v":0},"NOTA/OBSERVACIÓN -en mayúscula-:"]
["c SOCIO PH",{"$f":"B126","v":0},{"$f":"C126","v":0},"ESTADO CIVIL:",null,null,"c SOCIO PJ",null,"CUIT –sin puntos ni barras-:"]
["c SOCIO PH",{"$f":"IF($E135=\"CASADO/A\",B126,0)","v":0},{"$f":"IF($E135=\"CASADO/A\",C126,0)","v":0},{"$f":"IF(E135=\"CASADO/A\",\"APELLIDO/S CÓNYUGE:\",\"\")","v":""},null,null,"c SOCIO PJ",{"$f":"H135","v":0},"TIPO DE PERSONA JCA -sociedad, asociación, mutual, etc-:"]
["c SOCIO PH",{"$f":"IF($E135=\"CASADO/A\",B126,0)","v":0},{"$f":"IF($E135=\"CASADO/A\",C126,0)","v":0},{"$f":"IF(E135=\"CASADO/A\",\"NOMBRE/S CÓNYUGE:\",\"\")","v":""},null,null,"c SOCIO PJ",{"$f":"H135","v":0},"ORGANISMO /s DONDE SE INSCRIBIÓ CONSTITUCIÓN (INDICAR LOCALIDAD/PCIA DEL ORG) -si no se inscribió poner: NO INSCRIPTO/A:"]
["c SOCIO PH",{"$f":"IF($E135=\"CASADO/A\",B126,0)","v":0},{"$f":"IF($E135=\"CASADO/A\",C126,0)","v":0},{"$f":"IF(E135=\"CASADO/A\",\"DOC. IDENTIDAD (cónyuge) –sin puntos ni barras-:\",\"\")","v":""},null,null,"c SOCIO PJ",{"$f":"IF(I138=\"\",0,H135)","v":0},{"$f":"IF(OR(J137=\"NO INSCRIPTO/A\",J137=\"NO INSCR.\", J137=\"NO INSCR\",J137=\"N/I\", J137= \"NO INSCRIPTO\",J137=\"NO INSCRIPTA\"),\"\",\"DATOS DE RESOLUCIÓN Y FECHA DE INSCRIPCIÓN:\")","v":"DATOS DE RESOLUCIÓN Y FECHA DE INSCRIPCIÓN:"}]
["d CANT. ACC.",{"$f":"+B126","v":0},{"$f":"+C126","v":0},"NROS DE ACCIONES TITULAR:",null,null,"c SOCIO PJ",{"$f":"IF(I139=\"\",0,H135)","v":0},{"$f":"IF(I138=\"\",\"\",\"FECHA DE INSCRIPCION:\")","v":"FECHA DE INSCRIPCION:"}]
["g AP. DINERO",{"$f":"IF(AND($E141>0,$E140=0),0,B126)","v":0},{"$f":"IF(AND($E141>0,$E140=0),0,C126)","v":0},"APORTE EN DINERO:",null,null,"c SOCIO PJ",{"$f":"H135","v":0},"APELLIDO/S, NOMBRE/S,  DNI Y CARGO DE CADA MIEMBRO DE SU ADMINISTRACIÓN:"]
["g AP. ESPECIE",{"$f":"IF(AND($E140>0,$E141=0),0,B126)","v":0},{"$f":"IF(AND($E140>0,$E141=0),0,C126)","v":0},"APORTE EN ESPECIE (BS. NO DINERARIOS):",null,null,"c SOCIO PJ",{"$f":"IF(AND(J142>0,J141=0),0,H135)","v":0},"DOMICILIO SOCIAL:"]
["e CAP. SUSCR.",{"$f":"+B135","v":0},{"$f":"+C135","v":0},"CAPITAL SUSCRIPTO:",{"$f":"E140+E141","v":0},null,"c SOCIO PJ",{"$f":"IF(AND(J141>0,J142=0),0,H135)","v":0},"SEDE SOCIAL:"]
["h CAP. INTEG.",{"$f":"+B126","v":0},{"$f":"+C126","v":0},"CAPITAL A INTEGRAR (MÍNIMO):",{"$f":"+E140*0.25+E141","v":0},null,"c SOCIO PJ",{"$f":"H135","v":0},"CEL/TEL :"]
["f PARTICIPACION",{"$f":"+B126","v":0},{"$f":"+C126","v":0},"PARTICIPACIÓN S/CAPITAL (%):",{"$f":"+E142/'SOLICITUD-DATOS SOC'!$E$32","v":{"$error":"#DIV/0!"}},null,"c SOCIO PJ",{"$f":"H135","v":0},"OBJETO PRINCIPAL (EN FORMA RESUMIDA):"]
["i ORG. REP. LEGAL/ ADM.",{"$f":"IF(E145=0,0,B126)","v":0},{"$f":"IF(E145=0,0,C126)","v":0},"NOMBRE CARGO REP. LEGAL/ ADMINISTRACIÓN QUE OCUPA:",null,null,"d CANT. ACC.",{"$f":"+H135","v":0},"NROS DE ACCIONES TITULAR:"]
["j ORG. FISCALIZ.",{"$f":"IF(OR(E146=0,E146=\"PRESCINDE ART. 9 ACTO CONSTITUIVO\"),0,B126)","v":0},{"$f":"IF(OR(F147=0,E146=\"PRESCINDE ART.9 ACTO CONSTITUIVO\"),0,C126)","v":0},"NOMBRE CARGO FISCALIZACIÓN QUE OCUPA:",null,null,"g AP. DINERO",{"$f":"+IF(J146=0,0,H135)","v":0},"APORTE EN DINERO:"]
["c SOCIO PH",{"$f":"IF(E147=0,0,B126)","v":0},{"$f":"IF(E147=0,0,C126)","v":0},"NOTA/OBSERVACIÓN -en mayúscula-:",null,null,"g AP. ESPECIE",{"$f":"+IF(J147=0,0,H135)","v":0},"APORTE EN ESPECIE (BS. NO DINERARIOS):",0]
["c SOCIO PH",0,null,"DOC. IDENTIDAD –sin puntos-:",null,null,"e CAP. SUSCR.",{"$f":"+H135","v":0},"CAPITAL SUSCRIPTO:",{"$f":"J146+J147","v":0}]
["c SOCIO PH",{"$f":"+B148","v":0},{"$f":"+C148","v":0},"CUIT/CUIL –sin puntos ni barras-:",null,null,"h CAP. INTEG.",{"$f":"+H135","v":0},"CAPITAL A INTEGRAR (MÍNIMO):",{"$f":"+J146*0.25+J147","v":0}]
["c SOCIO PH",{"$f":"+B149","v":0},0,"FECHA DE NACIMIENTO –dd/mm/aa-:",null,null,"f PARTICIPACION",{"$f":"+H135","v":0},"PARTICIPACIÓN S/CAPITAL (%):",{"$f":"+J148/'SOLICITUD-DATOS SOC'!$E$32","v":{"$error":"#DIV/0!"}}]
["c SOCIO PH",0,0,"LUGAR DE NACIMIENTO:",null,null,"c SOCIO PJ",{"$f":"IF(J151=0,0,H135)","v":0},"NOTA/OBSERVACIÓN -en mayúscula-:"]
["c SOCIO PH",0,0,"NACIONALIDAD:",null,null,"c SOCIO PJ",null,"CUIT –sin puntos ni barras-:"]
["c SOCIO PH",0,0,"PROFESIÓN/OFICIO:",null,null,"c SOCIO PJ",{"$f":"H152","v":0},"TIPO DE PERSONA JCA -sociedad, asociación, mutual, etc-:"]
["c SOCIO PH",0,0,"DOMICILIO REAL:",null,null,"c SOCIO PJ",{"$f":"H152","v":0},"ORGANISMO /s DONDE SE INSCRIBIÓ CONSTITUCIÓN (INDICAR LOCALIDAD/PCIA DEL ORG) -si no se inscribió poner: NO INSCRIPTO/A:"]
["c SOCIO PH",0,0,"CEL/TEL :",null,null,"c SOCIO PJ",{"$f":"IF(I155=\"\",0,H152)","v":0},{"$f":"IF(OR(J154=\"NO INSCRIPTO/A\",J154=\"NO INSCR.\", J154=\"NO INSCR\",J154=\"N/I\", J154= \"NO INSCRIPTO\",J154=\"NO INSCRIPTA\"),\"\",\"DATOS DE RESOLUCIÓN Y FECHA DE INSCRIPCIÓN:\")","v":"DATOS DE RESOLUCIÓN Y FECHA DE INSCRIPCIÓN:"}]
["c SOCIO PH",{"$f":"IF(E156=0,0,B148)","v":0},{"$f":"IF(E156=0,0,C148)","v":0},"EMAIL:",null,null,"c SOCIO PJ",{"$f":"IF(I156=\"\",0,H152)","v":0},{"$f":"IF(I155=\"\",\"\",\"FECHA DE INSCRIPCION:\")","v":"FECHA DE INSCRIPCION:"}]
["c SOCIO PH",{"$f":"B148","v":0},{"$f":"C148","v":0},"ESTADO CIVIL:",null,null,"c SOCIO PJ",{"$f":"H152","v":0},"APELLIDO/S, NOMBRE/S,  DNI Y CARGO DE CADA MIEMBRO DE SU ADMINISTRACIÓN:"]
["c SOCIO PH",{"$f":"IF($E157=\"CASADO/A\",B148,0)","v":0},{"$f":"IF($E157=\"CASADO/A\",C148,0)","v":0},{"$f":"IF(E157=\"CASADO/A\",\"APELLIDO/S CÓNYUGE:\",\"\")","v":""},null,null,"c SOCIO PJ",{"$f":"IF(AND(J159>0,J158=0),0,H152)","v":0},"DOMICILIO SOCIAL:"]
["c SOCIO PH",{"$f":"IF($E157=\"CASADO/A\",B148,0)","v":0},{"$f":"IF($E157=\"CASADO/A\",C148,0)","v":0},{"$f":"IF(E157=\"CASADO/A\",\"NOMBRE/S CÓNYUGE:\",\"\")","v":""},null,null,"c SOCIO PJ",{"$f":"IF(AND(J158>0,J159=0),0,H152)","v":0},"SEDE SOCIAL:"]
["c SOCIO PH",{"$f":"IF($E157=\"CASADO/A\",B148,0)","v":0},{"$f":"IF($E157=\"CASADO/A\",C148,0)","v":0},{"$f":"IF(E157=\"CASADO/A\",\"DOC. IDENTIDAD (cónyuge) –sin puntos ni barras-:\",\"\")","v":""},null,null,"c SOCIO PJ",{"$f":"H152","v":0},"CEL/TEL :"]
["d CANT. ACC.",{"$f":"+B148","v":0},{"$f":"+C148","v":0},"NROS DE ACCIONES TITULAR:",null,null,"c SOCIO PJ",{"$f":"H152","v":0},"OBJETO PRINCIPAL (EN FORMA RESUMIDA):"]
["g AP. DINERO",{"$f":"IF(AND($E163>0,$E162=0),0,B148)","v":0},{"$f":"IF(AND($E163>0,$E162=0),0,C148)","v":0},"APORTE EN DINERO:",null,null,"d CANT. ACC.",{"$f":"+H152","v":0},"NROS DE ACCIONES TITULAR:"]
["g AP. ESPECIE",{"$f":"IF(AND($E162>0,$E163=0),0,B148)","v":0},{"$f":"IF(AND($E162>0,$E163=0),0,C148)","v":0},"APORTE EN ESPECIE (BS. NO DINERARIOS):",null,null,"g AP. DINERO",{"$f":"+IF(J163=0,0,H152)","v":0},"APORTE EN DINERO:"]
["e CAP. SUSCR.",{"$f":"+B157","v":0},{"$f":"+C157","v":0},"CAPITAL SUSCRIPTO:",{"$f":"E162+E163","v":0},null,"g AP. ESPECIE",{"$f":"+IF(J164=0,0,H152)","v":0},"APORTE EN ESPECIE (BS. NO DINERARIOS):",0]
["h CAP. INTEG.",{"$f":"+B148","v":0},{"$f":"+C148","v":0},"CAPITAL A INTEGRAR (MÍNIMO):",{"$f":"+E162*0.25+E163","v":0},null,"e CAP. SUSCR.",{"$f":"+H152","v":0},"CAPITAL SUSCRIPTO:",{"$f":"J163+J164","v":0}]
["f PARTICIPACION",{"$f":"+B148","v":0},{"$f":"+C148","v":0},"PARTICIPACIÓN S/CAPITAL (%):",{"$f":"+E164/'SOLICITUD-DATOS SOC'!$E$32","v":{"$error":"#DIV/0!"}},null,"h CAP. INTEG.",{"$f":"+H152","v":0},"CAPITAL A INTEGRAR (MÍNIMO):",{"$f":"+J163*0.25+J164","v":0}]
["i ORG. REP. LEGAL/ ADM.",{"$f":"IF(E167=0,0,B148)","v":0},{"$f":"IF(E167=0,0,C148)","v":0},"NOMBRE CARGO REP. LEGAL/ ADMINISTRACIÓN QUE OCUPA:",null,null,"f PARTICIPACION",{"$f":"+H152","v":0},"PARTICIPACIÓN S/CAPITAL (%):",{"$f":"+J165/'SOLICITUD-DATOS SOC'!$E$32","v":{"$error":"#DIV/0!"}}]
["j ORG. FISCALIZ.",{"$f":"IF(OR(E168=0,E168=\"PRESCINDE ART. 9 ACTO CONSTITUIVO\"),0,B148)","v":0},{"$f":"IF(OR(F169=0,E168=\"PRESCINDE ART.9 ACTO CONSTITUIVO\"),0,C148)","v":0},"NOMBRE CARGO FISCALIZACIÓN QUE OCUPA:",null,null,"c SOCIO PJ",{"$f":"IF(J168=0,0,H152)","v":0},"NOTA/OBSERVACIÓN -en mayúscula-:"]
["c SOCIO PH",{"$f":"IF(E169=0,0,B148)","v":0},{"$f":"IF(E169=0,0,C148)","v":0},"NOTA/OBSERVACIÓN -en mayúscula-:",null,null,"c SOCIO PJ",null,"CUIT –sin puntos ni barras-:"]
["c SOCIO PH",0,null,"DOC. IDENTIDAD –sin puntos-:",null,null,"c SOCIO PJ",{"$f":"H169","v":0},"TIPO DE PERSONA JCA -sociedad, asociación, mutual, etc-:"]
["c SOCIO PH",{"$f":"+B170","v":0},{"$f":"+C170","v":0},"CUIT/CUIL –sin puntos ni barras-:",null,null,"c SOCIO PJ",{"$f":"H169","v":0},"ORGANISMO /s DONDE SE INSCRIBIÓ CONSTITUCIÓN (INDICAR LOCALIDAD/PCIA DEL ORG) -si no se inscribió poner: NO INSCRIPTO/A:"]
["c SOCIO PH",{"$f":"+B171","v":0},0,"FECHA DE NACIMIENTO –dd/mm/aa-:",null,null,"c SOCIO PJ",{"$f":"IF(I172=\"\",0,H169)","v":0},{"$f":"IF(OR(J171=\"NO INSCRIPTO/A\",J171=\"NO INSCR.\", J171=\"NO INSCR\",J171=\"N/I\", J171= \"NO INSCRIPTO\",J171=\"NO INSCRIPTA\"),\"\",\"DATOS DE RESOLUCIÓN Y FECHA DE INSCRIPCIÓN:\")","v":"DATOS DE RESOLUCIÓN Y FECHA DE INSCRIPCIÓN:"}]
["c SOCIO PH",0,0,"LUGAR DE NACIMIENTO:",null,null,"c SOCIO PJ",{"$f":"IF(I173=\"\",0,H169)","v":0},{"$f":"IF(I172=\"\",\"\",\"FECHA DE INSCRIPCION:\")","v":"FECHA DE INSCRIPCION:"}]
["c SOCIO PH",0,0,"NACIONALIDAD:",null,null,"c SOCIO PJ",{"$f":"H169","v":0},"APELLIDO/S, NOMBRE/S,  DNI Y CARGO DE CADA MIEMBRO DE SU ADMINISTRACIÓN:"]
["c SOCIO PH",0,0,"PROFESIÓN/OFICIO:",null,null,"c SOCIO PJ",{"$f":"IF(AND(J176>0,J175=0),0,H169)","v":0},"DOMICILIO SOCIAL:"]
["c SOCIO PH",0,0,"DOMICILIO REAL:",null,null,"c SOCIO PJ",{"$f":"IF(AND(J175>0,J176=0),0,H169)","v":0},"SEDE SOCIAL:"]
["c SOCIO PH",0,0,"CEL/TEL :",null,null,"c SOCIO PJ",{"$f":"H169","v":0},"CEL/TEL :"]
["c SOCIO PH",{"$f":"IF(E178=0,0,B170)","v":0},{"$f":"IF(E178=0,0,C170)","v":0},"EMAIL:",null,null,"c SOCIO PJ",{"$f":"H169","v":0},"OBJETO PRINCIPAL (EN FORMA RESUMIDA):"]
["c SOCIO PH",{"$f":"B170","v":0},{"$f":"C170","v":0},"ESTADO CIVIL:",null,null,"d CANT. ACC.",{"$f":"+H169","v":0},"NROS DE ACCIONES TITULAR:"]
["c SOCIO PH",{"$f":"IF($E179=\"CASADO/A\",B170,0)","v":0},{"$f":"IF($E179=\"CASADO/A\",C170,0)","v":0},{"$f":"IF(E179=\"CASADO/A\",\"APELLIDO/S CÓNYUGE:\",\"\")","v":""},null,null,"g AP. DINERO",{"$f":"+IF(J180=0,0,H169)","v":0},"APORTE EN DINERO:"]
["c SOCIO PH",{"$f":"IF($E179=\"CASADO/A\",B170,0)","v":0},{"$f":"IF($E179=\"CASADO/A\",C170,0)","v":0},{"$f":"IF(E179=\"CASADO/A\",\"NOMBRE/S CÓNYUGE:\",\"\")","v":""},null,null,"g AP. ESPECIE",{"$f":"+IF(J181=0,0,H169)","v":0},"APORTE EN ESPECIE (BS. NO DINERARIOS):",0]
["c SOCIO PH",{"$f":"IF($E179=\"CASADO/A\",B170,0)","v":0},{"$f":"IF($E179=\"CASADO/A\",C170,0)","v":0},{"$f":"IF(E179=\"CASADO/A\",\"DOC. IDENTIDAD (cónyuge) –sin puntos ni barras-:\",\"\")","v":""},null,null,"e CAP. SUSCR.",{"$f":"+H169","v":0},"CAPITAL SUSCRIPTO:",{"$f":"J180+J181","v":0}]
["d CANT. ACC.",{"$f":"+B170","v":0},{"$f":"+C170","v":0},"NROS DE ACCIONES TITULAR:",null,null,"h CAP. INTEG.",{"$f":"+H169","v":0},"CAPITAL A INTEGRAR (MÍNIMO):",{"$f":"+J180*0.25+J181","v":0}]
["g AP. DINERO",{"$f":"IF(AND($E185>0,$E184=0),0,B170)","v":0},{"$f":"IF(AND($E185>0,$E184=0),0,C170)","v":0},"APORTE EN DINERO:",null,null,"f PARTICIPACION",{"$f":"+H169","v":0},"PARTICIPACIÓN S/CAPITAL (%):",{"$f":"+J182/'SOLICITUD-DATOS SOC'!$E$32","v":{"$error":"#DIV/0!"}}]
["g AP. ESPECIE",{"$f":"IF(AND($E184>0,$E185=0),0,B170)","v":0},{"$f":"IF(AND($E184>0,$E185=0),0,C170)","v":0},"APORTE EN ESPECIE (BS. NO DINERARIOS):",null,null,"c SOCIO PJ",{"$f":"IF(J185=0,0,H169)","v":0},"NOTA/OBSERVACIÓN -en mayúscula-:"]
["e CAP. SUSCR.",{"$f":"+B179","v":0},{"$f":"+C179","v":0},"CAPITAL SUSCRIPTO:",{"$f":"E184+E185","v":0}]
["h CAP. INTEG.",{"$f":"+B170","v":0},{"$f":"+C170","v":0},"CAPITAL A INTEGRAR (MÍNIMO):",{"$f":"+E184*0.25+E185","v":0}]
["f PARTICIPACION",{"$f":"+B170","v":0},{"$f":"+C170","v":0},"PARTICIPACIÓN S/CAPITAL (%):",{"$f":"+E186/'SOLICITUD-DATOS SOC'!$E$32","v":{"$error":"#DIV/0!"}}]
["i ORG. REP. LEGAL/ ADM.",{"$f":"IF(E189=0,0,B170)","v":0},{"$f":"IF(E189=0,0,C170)","v":0},"NOMBRE CARGO REP. LEGAL/ ADMINISTRACIÓN QUE OCUPA:"]
["j ORG. FISCALIZ.",{"$f":"IF(OR(E190=0,E190=\"PRESCINDE ART. 9 ACTO CONSTITUIVO\"),0,B170)","v":0},{"$f":"IF(OR(F191=0,E190=\"PRESCINDE ART.9 ACTO CONSTITUIVO\"),0,C170)","v":0},"NOMBRE CARGO FISCALIZACIÓN QUE OCUPA:"]
["c SOCIO PH",{"$f":"IF(E191=0,0,B170)","v":0},{"$f":"IF(E191=0,0,C170)","v":0},"NOTA/OBSERVACIÓN -en mayúscula-:"]
["c SOCIO PH",0,null,"DOC. IDENTIDAD –sin puntos-:"]
["c SOCIO PH",{"$f":"+B192","v":0},{"$f":"+C192","v":0},"CUIT/CUIL –sin puntos ni barras-:"]
["c SOCIO PH",{"$f":"+B193","v":0},0,"FECHA DE NACIMIENTO –dd/mm/aa-:"]
["c SOCIO PH",0,0,"LUGAR DE NACIMIENTO:"]
["c SOCIO PH",0,0,"NACIONALIDAD:"]
["c SOCIO PH",0,0,"PROFESIÓN/OFICIO:"]
["c SOCIO PH",0,0,"DOMICILIO REAL:"]
["c SOCIO PH",0,0,"CEL/TEL :"]
["c SOCIO PH",{"$f":"IF(E200=0,0,B192)","v":0},{"$f":"IF(E200=0,0,C192)","v":0},"EMAIL:"]
["c SOCIO PH",{"$f":"B192","v":0},{"$f":"C192","v":0},"ESTADO CIVIL:"]
["c SOCIO PH",{"$f":"IF($E201=\"CASADO/A\",B192,0)","v":0},{"$f":"IF($E201=\"CASADO/A\",C192,0)","v":0},{"$f":"IF(E201=\"CASADO/A\",\"APELLIDO/S CÓNYUGE:\",\"\")","v":""}]
["c SOCIO PH",{"$f":"IF($E201=\"CASADO/A\",B192,0)","v":0},{"$f":"IF($E201=\"CASADO/A\",C192,0)","v":0},{"$f":"IF(E201=\"CASADO/A\",\"NOMBRE/S CÓNYUGE:\",\"\")","v":""}]
["c SOCIO PH",{"$f":"IF($E201=\"CASADO/A\",B192,0)","v":0},{"$f":"IF($E201=\"CASADO/A\",C192,0)","v":0},{"$f":"IF(E201=\"CASADO/A\",\"DOC. IDENTIDAD (cónyuge) –sin puntos ni barras-:\",\"\")","v":""}]
["d CANT. ACC.",{"$f":"+B192","v":0},{"$f":"+C192","v":0},"NROS DE ACCIONES TITULAR:"]
["g AP. DINERO",{"$f":"IF(AND($E207>0,$E206=0),0,B192)","v":0},{"$f":"IF(AND($E207>0,$E206=0),0,C192)","v":0},"APORTE EN DINERO:"]
["g AP. ESPECIE",{"$f":"IF(AND($E206>0,$E207=0),0,B192)","v":0},{"$f":"IF(AND($E206>0,$E207=0),0,C192)","v":0},"APORTE EN ESPECIE (BS. NO DINERARIOS):"]
["e CAP. SUSCR.",{"$f":"+B201","v":0},{"$f":"+C201","v":0},"CAPITAL SUSCRIPTO:",{"$f":"E206+E207","v":0}]
["h CAP. INTEG.",{"$f":"+B192","v":0},{"$f":"+C192","v":0},"CAPITAL A INTEGRAR (MÍNIMO):",{"$f":"+E206*0.25+E207","v":0}]
["f PARTICIPACION",{"$f":"+B192","v":0},{"$f":"+C192","v":0},"PARTICIPACIÓN S/CAPITAL (%):",{"$f":"+E208/'SOLICITUD-DATOS SOC'!$E$32","v":{"$error":"#DIV/0!"}}]
["i ORG. REP. LEGAL/ ADM.",{"$f":"IF(E211=0,0,B192)","v":0},{"$f":"IF(E211=0,0,C192)","v":0},"NOMBRE CARGO REP. LEGAL/ ADMINISTRACIÓN QUE OCUPA:"]
["j ORG. FISCALIZ.",{"$f":"IF(OR(E212=0,E212=\"PRESCINDE ART. 9 ACTO CONSTITUIVO\"),0,B192)","v":0},{"$f":"IF(OR(F213=0,E212=\"PRESCINDE ART.9 ACTO CONSTITUIVO\"),0,C192)","v":0},"NOMBRE CARGO FISCALIZACIÓN QUE OCUPA:"]
["c SOCIO PH",{"$f":"IF(E213=0,0,B192)","v":0},{"$f":"IF(E213=0,0,C192)","v":0},"NOTA/OBSERVACIÓN -en mayúscula-:"]
["c SOCIO PH",0,null,"DOC. IDENTIDAD –sin puntos-:"]
["c SOCIO PH",{"$f":"+B214","v":0},{"$f":"+C214","v":0},"CUIT/CUIL –sin puntos ni barras-:"]
["c SOCIO PH",{"$f":"+B215","v":0},0,"FECHA DE NACIMIENTO –dd/mm/aa-:"]
["c SOCIO PH",0,0,"LUGAR DE NACIMIENTO:"]
["c SOCIO PH",0,0,"NACIONALIDAD:"]
["c SOCIO PH",0,0,"PROFESIÓN/OFICIO:"]
["c SOCIO PH",0,0,"DOMICILIO REAL:"]
["c SOCIO PH",0,0,"CEL/TEL :"]
["c SOCIO PH",{"$f":"IF(E222=0,0,B214)","v":0},{"$f":"IF(E222=0,0,C214)","v":0},"EMAIL:"]
["c SOCIO PH",{"$f":"B214","v":0},{"$f":"C214","v":0},"ESTADO CIVIL:"]
["c SOCIO PH",{"$f":"IF($E223=\"CASADO/A\",B214,0)","v":0},{"$f":"IF($E223=\"CASADO/A\",C214,0)","v":0},{"$f":"IF(E223=\"CASADO/A\",\"APELLIDO/S CÓNYUGE:\",\"\")","v":""}]
["c SOCIO PH",{"$f":"IF($E223=\"CASADO/A\",B214,0)","v":0},{"$f":"IF($E223=\"CASADO/A\",C214,0)","v":0},{"$f":"IF(E223=\"CASADO/A\",\"NOMBRE/S CÓNYUGE:\",\"\")","v":""}]
["c SOCIO PH",{"$f":"IF($E223=\"CASADO/A\",B214,0)","v":0},{"$f":"IF($E223=\"CASADO/A\",C214,0)","v":0},{"$f":"IF(E223=\"CASADO/A\",\"DOC. IDENTIDAD (cónyuge) –sin puntos ni barras-:\",\"\")","v":""}]
["d CANT. ACC.",{"$f":"+B214","v":0},{"$f":"+C214","v":0},"NROS DE ACCIONES TITULAR:"]
["g AP. DINERO",{"$f":"IF(AND($E229>0,$E228=0),0,B214)","v":0},{"$f":"IF(AND($E229>0,$E228=0),0,C214)","v":0},"APORTE EN DINERO:"]
["g AP. ESPECIE",{"$f":"IF(AND($E228>0,$E229=0),0,B214)","v":0},{"$f":"IF(AND($E228>0,$E229=0),0,C214)","v":0},"APORTE EN ESPECIE (BS. NO DINERARIOS):"]
["e CAP. SUSCR.",{"$f":"+B223","v":0},{"$f":"+C223","v":0},"CAPITAL SUSCRIPTO:",{"$f":"E228+E229","v":0}]
["h CAP. INTEG.",{"$f":"+B214","v":0},{"$f":"+C214","v":0},"CAPITAL A INTEGRAR (MÍNIMO):",{"$f":"+E228*0.25+E229","v":0}]
["f PARTICIPACION",{"$f":"+B214","v":0},{"$f":"+C214","v":0},"PARTICIPACIÓN S/CAPITAL (%):",{"$f":"+E230/'SOLICITUD-DATOS SOC'!$E$32","v":{"$error":"#DIV/0!"}}]
["i ORG. REP. LEGAL/ ADM.",{"$f":"IF(E233=0,0,B214)","v":0},{"$f":"IF(E233=0,0,C214)","v":0},"NOMBRE CARGO REP. LEGAL/ ADMINISTRACIÓN QUE OCUPA:"]
["j ORG. FISCALIZ.",{"$f":"IF(OR(E234=0,E234=\"PRESCINDE ART. 9 ACTO CONSTITUIVO\"),0,B214)","v":0},{"$f":"IF(OR(F235=0,E234=\"PRESCINDE ART.9 ACTO CONSTITUIVO\"),0,C214)","v":0},"NOMBRE CARGO FISCALIZACIÓN QUE OCUPA:"]
["c SOCIO PH",{"$f":"IF(E235=0,0,B214)","v":0},{"$f":"IF(E235=0,0,C214)","v":0},"NOTA/OBSERVACIÓN -en mayúscula-:"]
["c SOCIO PH",0,null,"DOC. IDENTIDAD –sin puntos-:"]
["c SOCIO PH",{"$f":"+B236","v":0},{"$f":"+C236","v":0},"CUIT/CUIL –sin puntos ni barras-:"]
["c SOCIO PH",{"$f":"+B237","v":0},0,"FECHA DE NACIMIENTO –dd/mm/aa-:"]
["c SOCIO PH",0,0,"LUGAR DE NACIMIENTO:"]
["c SOCIO PH",0,0,"NACIONALIDAD:"]
["c SOCIO PH",0,0,"PROFESIÓN/OFICIO:"]
["c SOCIO PH",0,0,"DOMICILIO REAL:"]
["c SOCIO PH",0,0,"CEL/TEL :"]
["c SOCIO PH",{"$f":"IF(E244=0,0,B236)","v":0},{"$f":"IF(E244=0,0,C236)","v":0},"EMAIL:"]
["c SOCIO PH",{"$f":"B236","v":0},{"$f":"C236","v":0},"ESTADO CIVIL:"]
["c SOCIO PH",{"$f":"IF($E245=\"CASADO/A\",B236,0)","v":0},{"$f":"IF($E245=\"CASADO/A\",C236,0)","v":0},{"$f":"IF(E245=\"CASADO/A\",\"APELLIDO/S CÓNYUGE:\",\"\")","v":""}]
["c SOCIO PH",{"$f":"IF($E245=\"CASADO/A\",B236,0)","v":0},{"$f":"IF($E245=\"CASADO/A\",C236,0)","v":0},{"$f":"IF(E245=\"CASADO/A\",\"NOMBRE/S CÓNYUGE:\",\"\")","v":""}]
["c SOCIO PH",{"$f":"IF($E245=\"CASADO/A\",B236,0)","v":0},{"$f":"IF($E245=\"CASADO/A\",C236,0)","v":0},{"$f":"IF(E245=\"CASADO/A\",\"DOC. IDENTIDAD (cónyuge) –sin puntos ni barras-:\",\"\")","v":""}]
["d CANT. ACC.",{"$f":"+B236","v":0},{"$f":"+C236","v":0},"NROS DE ACCIONES TITULAR:"]
["g AP. DINERO",{"$f":"IF(AND($E251>0,$E250=0),0,B236)","v":0},{"$f":"IF(AND($E251>0,$E250=0),0,C236)","v":0},"APORTE EN DINERO:"]
["g AP. ESPECIE",{"$f":"IF(AND($E250>0,$E251=0),0,B236)","v":0},{"$f":"IF(AND($E250>0,$E251=0),0,C236)","v":0},"APORTE EN ESPECIE (BS. NO DINERARIOS):"]
["e CAP. SUSCR.",{"$f":"+B245","v":0},{"$f":"+C245","v":0},"CAPITAL SUSCRIPTO:",{"$f":"E250+E251","v":0}]
["h CAP. INTEG.",{"$f":"+B236","v":0},{"$f":"+C236","v":0},"CAPITAL A INTEGRAR (MÍNIMO):",{"$f":"+E250*0.25+E251","v":0}]
["f PARTICIPACION",{"$f":"+B236","v":0},{"$f":"+C236","v":0},"PARTICIPACIÓN S/CAPITAL (%):",{"$f":"+E252/'SOLICITUD-DATOS SOC'!$E$32","v":{"$error":"#DIV/0!"}}]
["i ORG. REP. LEGAL/ ADM.",{"$f":"IF(E255=0,0,B236)","v":0},{"$f":"IF(E255=0,0,C236)","v":0},"NOMBRE CARGO REP. LEGAL/ ADMINISTRACIÓN QUE OCUPA:"]
["j ORG. FISCALIZ.",{"$f":"IF(OR(E256=0,E256=\"PRESCINDE ART. 9 ACTO CONSTITUIVO\"),0,B236)","v":0},{"$f":"IF(OR(F257=0,E256=\"PRESCINDE ART.9 ACTO CONSTITUIVO\"),0,C236)","v":0},"NOMBRE CARGO FISCALIZACIÓN QUE OCUPA:"]
["c SOCIO PH",{"$f":"IF(E257=0,0,B236)","v":0},{"$f":"IF(E257=0,0,C236)","v":0},"NOTA/OBSERVACIÓN -en mayúscula-:"]
["c SOCIO PH",0,null,"DOC. IDENTIDAD –sin puntos-:"]
["c SOCIO PH",{"$f":"+B258","v":0},{"$f":"+C258","v":0},"CUIT/CUIL –sin puntos ni barras-:"]
["c SOCIO PH",{"$f":"+B259","v":0},0,"FECHA DE NACIMIENTO –dd/mm/aa-:"]
["c SOCIO PH",0,0,"LUGAR DE NACIMIENTO:"]
["c SOCIO PH",0,0,"NACIONALIDAD:"]
["c SOCIO PH",0,0,"PROFESIÓN/OFICIO:"]
["c SOCIO PH",0,0,"DOMICILIO REAL:"]
["c SOCIO PH",0,0,"CEL/TEL :"]
["c SOCIO PH",{"$f":"IF(E266=0,0,B258)","v":0},{"$f":"IF(E266=0,0,C258)","v":0},"EMAIL:"]
["c SOCIO PH",{"$f":"B258","v":0},{"$f":"C258","v":0},"ESTADO CIVIL:"]
["c SOCIO PH",{"$f":"IF($E267=\"CASADO/A\",B258,0)","v":0},{"$f":"IF($E267=\"CASADO/A\",C258,0)","v":0},{"$f":"IF(E267=\"CASADO/A\",\"APELLIDO/S CÓNYUGE:\",\"\")","v":""}]
["c SOCIO PH",{"$f":"IF($E267=\"CASADO/A\",B258,0)","v":0},{"$f":"IF($E267=\"CASADO/A\",C258,0)","v":0},{"$f":"IF(E267=\"CASADO/A\",\"NOMBRE/S CÓNYUGE:\",\"\")","v":""}]
["c SOCIO PH",{"$f":"IF($E267=\"CASADO/A\",B258,0)","v":0},{"$f":"IF($E267=\"CASADO/A\",C258,0)","v":0},{"$f":"IF(E267=\"CASADO/A\",\"DOC. IDENTIDAD (cónyuge) –sin puntos ni barras-:\",\"\")","v":""}]
["d CANT. ACC.",{"$f":"+B258","v":0},{"$f":"+C258","v":0},"NROS DE ACCIONES TITULAR:"]
["g AP. DINERO",{"$f":"IF(AND($E273>0,$E272=0),0,B258)","v":0},{"$f":"IF(AND($E273>0,$E272=0),0,C258)","v":0},"APORTE EN DINERO:"]
["g AP. ESPECIE",{"$f":"IF(AND($E272>0,$E273=0),0,B258)","v":0},{"$f":"IF(AND($E272>0,$E273=0),0,C258)","v":0},"APORTE EN ESPECIE (BS. NO DINERARIOS):"]
["e CAP. SUSCR.",{"$f":"+B267","v":0},{"$f":"+C267","v":0},"CAPITAL SUSCRIPTO:",{"$f":"E272+E273","v":0}]
["h CAP. INTEG.",{"$f":"+B258","v":0},{"$f":"+C258","v":0},"CAPITAL A INTEGRAR (MÍNIMO):",{"$f":"+E272*0.25+E273","v":0}]
["f PARTICIPACION",{"$f":"+B258","v":0},{"$f":"+C258","v":0},"PARTICIPACIÓN S/CAPITAL (%):",{"$f":"+E274/'SOLICITUD-DATOS SOC'!$E$32","v":{"$error":"#DIV/0!"}}]
["i ORG. REP. LEGAL/ ADM.",{"$f":"IF(E277=0,0,B258)","v":0},{"$f":"IF(E277=0,0,C258)","v":0},"NOMBRE CARGO REP. LEGAL/ ADMINISTRACIÓN QUE OCUPA:"]
["j ORG. FISCALIZ.",{"$f":"IF(OR(E278=0,E278=\"PRESCINDE ART. 9 ACTO CONSTITUIVO\"),0,B258)","v":0},{"$f":"IF(OR(F279=0,E278=\"PRESCINDE ART.9 ACTO CONSTITUIVO\"),0,C258)","v":0},"NOMBRE CARGO FISCALIZACIÓN QUE OCUPA:"]
["c SOCIO PH",{"$f":"IF(E279=0,0,B258)","v":0},{"$f":"IF(E279=0,0,C258)","v":0},"NOTA/OBSERVACIÓN -en mayúscula-:"]
["c SOCIO PH",0,null,"DOC. IDENTIDAD –sin puntos-:"]
["c SOCIO PH",{"$f":"+B280","v":0},{"$f":"+C280","v":0},"CUIT/CUIL –sin puntos ni barras-:"]
["c SOCIO PH",{"$f":"+B281","v":0},0,"FECHA DE NACIMIENTO –dd/mm/aa-:"]
["c SOCIO PH",0,0,"LUGAR DE NACIMIENTO:"]
["c SOCIO PH",0,0,"NACIONALIDAD:"]
["c SOCIO PH",0,0,"PROFESIÓN/OFICIO:"]
["c SOCIO PH",0,0,"DOMICILIO REAL:"]
["c SOCIO PH",0,0,"CEL/TEL :"]
["c SOCIO PH",{"$f":"IF(E288=0,0,B280)","v":0},{"$f":"IF(E288=0,0,C280)","v":0},"EMAIL:"]
["c SOCIO PH",{"$f":"B280","v":0},{"$f":"C280","v":0},"ESTADO CIVIL:"]
["c SOCIO PH",{"$f":"IF($E289=\"CASADO/A\",B280,0)","v":0},{"$f":"IF($E289=\"CASADO/A\",C280,0)","v":0},{"$f":"IF(E289=\"CASADO/A\",\"APELLIDO/S CÓNYUGE:\",\"\")","v":""}]
["c SOCIO PH",{"$f":"IF($E289=\"CASADO/A\",B280,0)","v":0},{"$f":"IF($E289=\"CASADO/A\",C280,0)","v":0},{"$f":"IF(E289=\"CASADO/A\",\"NOMBRE/S CÓNYUGE:\",\"\")","v":""}]
["c SOCIO PH",{"$f":"IF($E289=\"CASADO/A\",B280,0)","v":0},{"$f":"IF($E289=\"CASADO/A\",C280,0)","v":0},{"$f":"IF(E289=\"CASADO/A\",\"DOC. IDENTIDAD (cónyuge) –sin puntos ni barras-:\",\"\")","v":""}]
["d CANT. ACC.",{"$f":"+B280","v":0},{"$f":"+C280","v":0},"NROS DE ACCIONES TITULAR:"]
["g AP. DINERO",{"$f":"IF(AND($E295>0,$E294=0),0,B280)","v":0},{"$f":"IF(AND($E295>0,$E294=0),0,C280)","v":0},"APORTE EN DINERO:"]
["g AP. ESPECIE",{"$f":"IF(AND($E294>0,$E295=0),0,B280)","v":0},{"$f":"IF(AND($E294>0,$E295=0),0,C280)","v":0},"APORTE EN ESPECIE (BS. NO DINERARIOS):"]
["e CAP. SUSCR.",{"$f":"+B289","v":0},{"$f":"+C289","v":0},"CAPITAL SUSCRIPTO:",{"$f":"E294+E295","v":0}]
["h CAP. INTEG.",{"$f":"+B280","v":0},{"$f":"+C280","v":0},"CAPITAL A INTEGRAR (MÍNIMO):",{"$f":"+E294*0.25+E295","v":0}]
["f PARTICIPACION",{"$f":"+B280","v":0},{"$f":"+C280","v":0},"PARTICIPACIÓN S/CAPITAL (%):",{"$f":"+E296/'SOLICITUD-DATOS SOC'!$E$32","v":{"$error":"#DIV/0!"}}]
["i ORG. REP. LEGAL/ ADM.",{"$f":"IF(E299=0,0,B280)","v":0},{"$f":"IF(E299=0,0,C280)","v":0},"NOMBRE CARGO REP. LEGAL/ ADMINISTRACIÓN QUE OCUPA:"]
["j ORG. FISCALIZ.",{"$f":"IF(OR(E300=0,E300=\"PRESCINDE ART. 9 ACTO CONSTITUIVO\"),0,B280)","v":0},{"$f":"IF(OR(F301=0,E300=\"PRESCINDE ART.9 ACTO CONSTITUIVO\"),0,C280)","v":0},"NOMBRE CARGO FISCALIZACIÓN QUE OCUPA:"]
["c SOCIO PH",{"$f":"IF(E301=0,0,B280)","v":0},{"$f":"IF(E301=0,0,C280)","v":0},"NOTA/OBSERVACIÓN -en mayúscula-:"]
["c SOCIO PH",0,null,"DOC. IDENTIDAD –sin puntos-:"]
["c SOCIO PH",{"$f":"+B302","v":0},{"$f":"+C302","v":0},"CUIT/CUIL –sin puntos ni barras-:"]
["c SOCIO PH",{"$f":"+B303","v":0},0,"FECHA DE NACIMIENTO –dd/mm/aa-:"]
["c SOCIO PH",0,0,"LUGAR DE NACIMIENTO:"]
["c SOCIO PH",0,0,"NACIONALIDAD:"]
["c SOCIO PH",0,0,"PROFESIÓN/OFICIO:"]
["c SOCIO PH",0,0,"DOMICILIO REAL:"]
["c SOCIO PH",0,0,"CEL/TEL :"]
["c SOCIO PH",{"$f":"IF(E310=0,0,B302)","v":0},{"$f":"IF(E310=0,0,C302)","v":0},"EMAIL:"]
["c SOCIO PH",{"$f":"B302","v":0},{"$f":"C302","v":0},"ESTADO CIVIL:"]
["c SOCIO PH",{"$f":"IF($E311=\"CASADO/A\",B302,0)","v":0},{"$f":"IF($E311=\"CASADO/A\",C302,0)","v":0},{"$f":"IF(E311=\"CASADO/A\",\"APELLIDO/S CÓNYUGE:\",\"\")","v":""}]
["c SOCIO PH",{"$f":"IF($E311=\"CASADO/A\",B302,0)","v":0},{"$f":"IF($E311=\"CASADO/A\",C302,0)","v":0},{"$f":"IF(E311=\"CASADO/A\",\"NOMBRE/S CÓNYUGE:\",\"\")","v":""}]
["c SOCIO PH",{"$f":"IF($E311=\"CASADO/A\",B302,0)","v":0},{"$f":"IF($E311=\"CASADO/A\",C302,0)","v":0},{"$f":"IF(E311=\"CASADO/A\",\"DOC. IDENTIDAD (cónyuge) –sin puntos ni barras-:\",\"\")","v":""}]
["d CANT. ACC.",{"$f":"+B302","v":0},{"$f":"+C302","v":0},"NROS DE ACCIONES TITULAR:"]
["g AP. DINERO",{"$f":"IF(AND($E317>0,$E316=0),0,B302)","v":0},{"$f":"IF(AND($E317>0,$E316=0),0,C302)","v":0},"APORTE EN DINERO:"]
["g AP. ESPECIE",{"$f":"IF(AND($E316>0,$E317=0),0,B302)","v":0},{"$f":"IF(AND($E316>0,$E317=0),0,C302)","v":0},"APORTE EN ESPECIE (BS. NO DINERARIOS):"]
["e CAP. SUSCR.",{"$f":"+B311","v":0},{"$f":"+C311","v":0},"CAPITAL SUSCRIPTO:",{"$f":"E316+E317","v":0}]
["h CAP. INTEG.",{"$f":"+B302","v":0},{"$f":"+C302","v":0},"CAPITAL A INTEGRAR (MÍNIMO):",{"$f":"+E316*0.25+E317","v":0}]
["f PARTICIPACION",{"$f":"+B302","v":0},{"$f":"+C302","v":0},"PARTICIPACIÓN S/CAPITAL (%):",{"$f":"+E318/'SOLICITUD-DATOS SOC'!$E$32","v":{"$error":"#DIV/0!"}}]
["i ORG. REP. LEGAL/ ADM.",{"$f":"IF(E321=0,0,B302)","v":0},{"$f":"IF(E321=0,0,C302)","v":0},"NOMBRE CARGO REP. LEGAL/ ADMINISTRACIÓN QUE OCUPA:"]
["j ORG. FISCALIZ.",{"$f":"IF(OR(E322=0,E322=\"PRESCINDE ART. 9 ACTO CONSTITUIVO\"),0,B302)","v":0},{"$f":"IF(OR(F323=0,E322=\"PRESCINDE ART.9 ACTO CONSTITUIVO\"),0,C302)","v":0},"NOMBRE CARGO FISCALIZACIÓN QUE OCUPA:"]
["c SOCIO PH",{"$f":"IF(E323=0,0,B302)","v":0},{"$f":"IF(E323=0,0,C302)","v":0},"NOTA/OBSERVACIÓN -en mayúscula-:"]

{"sheet":"NO SOCIOS","index":3,"n_rows":247,"n_cols":4,"rows_kept":247,"cut":false,"hidden":false,"merged":[[1,0,1,4],[2,0,2,4],[3,0,3,2],[3,3,3,4],[6,3,6,4],[5,0,5,4]]}
[{"$f":"+'SOLICITUD-DATOS SOC'!A1","v":"DATOS SOCIALES "}]
["(COMPLETAR CELDAS CON FONDO VERDE)"]
["Unidad de Registro Publico y Contralor de Personas Jurídicas   - Av. San Martín N° 2034 - Río Gallegos"]
["NOMBRE DE LA SOCIEDAD:",null,null,{"$f":"+'SOLICITUD-DATOS SOC'!D4:E4","v":0}]
[null,"FECHA:",{"$f":"+'SOLICITUD-DATOS SOC'!D5","v":"00:00:00"}]
["TERCEROS -NO SOCIOS- INTEGRANTES DE LOS ORGANOS DE LAS SOCIEDAD  (si no alcanza llenar excedente en Form SAS 5)"]
["REFER.","APELLIDO/s DEL TERCERO","APELLIDO/s DEL TERCERO","DATOS"]
["l NO SOCIO",null,null,"DOC. IDENTIDAD –sin puntos-:"]
["l NO SOCIO",{"$f":"B8","v":0},{"$f":"C8","v":0},"CUIT/CUIL –sin puntos ni barras-:"]
["l NO SOCIO",{"$f":"B8","v":0},{"$f":"C8","v":0},"FECHA DE NACIMIENTO –dd/mm/aa-:"]
["l NO SOCIO",{"$f":"B8","v":0},{"$f":"C8","v":0},"LUGAR DE NACIMIENTO:"]
["l NO SOCIO",{"$f":"B8","v":0},{"$f":"C8","v":0},"NACIONALIDAD:"]
["l NO SOCIO",{"$f":"B8","v":0},{"$f":"C8","v":0},"PROFESIÓN/OFICIO:"]
["l NO SOCIO",{"$f":"B8","v":0},{"$f":"C8","v":0},"DOMICILIO REAL:"]
["l NO SOCIO",{"$f":"B8","v":0},{"$f":"C8","v":0},"CEL/TEL :"]
["l NO SOCIO",{"$f":"+IF(E16=0,0,B8)","v":0},{"$f":"+IF(E16=0,0,C8)","v":0},"EMAIL:"]
["l NO SOCIO",{"$f":"B8","v":0},{"$f":"C8","v":0},"ESTADO CIVIL:"]
["l NO SOCIO",{"$f":"IF($E17=\"CASADO/A\",B8,0)","v":0},{"$f":"IF($E17=\"CASADO/A\",C8,0)","v":0},{"$f":"IF(E17=\"CASADO/A\",\"APELLIDO/S CÓNYUGE:\",\"\")","v":""}]
["l NO SOCIO",{"$f":"IF($E17=\"CASADO/A\",B8,0)","v":0},{"$f":"IF($E17=\"CASADO/A\",C8,0)","v":0},{"$f":"IF(E17=\"CASADO/A\",\"NOMBRE/S CÓNYUGE:\",\"\")","v":""}]
["l NO SOCIO",{"$f":"IF($E17=\"CASADO/A\",B8,0)","v":0},{"$f":"IF($E17=\"CASADO/A\",C8,0)","v":0},{"$f":"IF(E17=\"CASADO/A\",\"DOC. IDENTIDAD (cónyuge) –sin puntos ni barras-:\",\"\")","v":""}]
["i ORG. REP. LEGAL/ ADM.",{"$f":"IF(E21=0,0,B8)","v":0},{"$f":"IF(E21=0,0,C8)","v":0},"NOMBRE CARGO REP. LEGAL/ ADMINISTRACIÓN QUE OCUPA:"]
["j ORG. FISCALIZ.",{"$f":"IF(OR(E22=0,E22=\"PRESCINDE ART. 9 ACTO CONSTITUIVO\"),0,B8)","v":0},{"$f":"IF(OR(F22=0,E22=\"PRESCINDE ART.9 ACTO CONSTITUIVO\"),0,C8)","v":0},"NOMBRE CARGO FISCALIZACIÓN QUE OCUPA:"]
["l NO SOCIO",{"$f":"IF(E23=0,0,B8)","v":0},{"$f":"IF(E23=0,0,C8)","v":0},"NOTA/OBSERVACIÓN -en mayúscula-:"]
["l NO SOCIO",null,null,"DOC. IDENTIDAD –sin puntos-:"]
["l NO SOCIO",{"$f":"B24","v":0},{"$f":"C24","v":0},"CUIT/CUIL –sin puntos ni barras-:"]
["l NO SOCIO",{"$f":"B24","v":0},{"$f":"C24","v":0},"FECHA DE NACIMIENTO –dd/mm/aa-:"]
["l NO SOCIO",{"$f":"B24","v":0},{"$f":"C24","v":0},"LUGAR DE NACIMIENTO:"]
["l NO SOCIO",{"$f":"B24","v":0},{"$f":"C24","v":0},"NACIONALIDAD:"]
["l NO SOCIO",{"$f":"B24","v":0},{"$f":"C24","v":0},"PROFESIÓN/OFICIO:"]
["l NO SOCIO",{"$f":"B24","v":0},{"$f":"C24","v":0},"DOMICILIO REAL:"]
["l NO SOCIO",{"$f":"B24","v":0},{"$f":"C24","v":0},"CEL/TEL :"]
["l NO SOCIO",{"$f":"+IF(E32=0,0,B24)","v":0},{"$f":"+IF(E32=0,0,C24)","v":0},"EMAIL:"]
["l NO SOCIO",{"$f":"B24","v":0},{"$f":"C24","v":0},"ESTADO CIVIL:"]
["l NO SOCIO",{"$f":"IF($E33=\"CASADO/A\",B24,0)","v":0},{"$f":"IF($E33=\"CASADO/A\",C24,0)","v":0},{"$f":"IF(E33=\"CASADO/A\",\"APELLIDO/S CÓNYUGE:\",\"\")","v":""}]
["l NO SOCIO",{"$f":"IF($E33=\"CASADO/A\",B24,0)","v":0},{"$f":"IF($E33=\"CASADO/A\",C24,0)","v":0},{"$f":"IF(E33=\"CASADO/A\",\"NOMBRE/S CÓNYUGE:\",\"\")","v":""}]
["l NO SOCIO",{"$f":"IF($E33=\"CASADO/A\",B24,0)","v":0},{"$f":"IF($E33=\"CASADO/A\",C24,0)","v":0},{"$f":"IF(E33=\"CASADO/A\",\"DOC. IDENTIDAD (cónyuge) –sin puntos ni barras-:\",\"\")","v":""}]
["i ORG. REP. LEGAL/ ADM.",{"$f":"IF(E37=0,0,B24)","v":0},{"$f":"IF(E37=0,0,C24)","v":0},"NOMBRE CARGO REP. LEGAL/ ADMINISTRACIÓN QUE OCUPA:"]
["j ORG. FISCALIZ.",{"$f":"IF(OR(E38=0,E38=\"PRESCINDE ART. 9 ACTO CONSTITUIVO\"),0,B24)","v":0},{"$f":"IF(OR(F38=0,E38=\"PRESCINDE ART.9 ACTO CONSTITUIVO\"),0,C24)","v":0},"NOMBRE CARGO FISCALIZACIÓN QUE OCUPA:"]
["l NO SOCIO",{"$f":"IF(E39=0,0,B24)","v":0},{"$f":"IF(E39=0,0,C24)","v":0},"NOTA/OBSERVACIÓN -en mayúscula-:"]
["l NO SOCIO",null,null,"DOC. IDENTIDAD –sin puntos-:"]
["l NO SOCIO",{"$f":"B40","v":0},{"$f":"C40","v":0},"CUIT/CUIL –sin puntos ni barras-:"]
["l NO SOCIO",{"$f":"B40","v":0},{"$f":"C40","v":0},"FECHA DE NACIMIENTO –dd/mm/aa-:"]
["l NO SOCIO",{"$f":"B40","v":0},{"$f":"C40","v":0},"LUGAR DE NACIMIENTO:"]
["l NO SOCIO",{"$f":"B40","v":0},{"$f":"C40","v":0},"NACIONALIDAD:"]
["l NO SOCIO",{"$f":"B40","v":0},{"$f":"C40","v":0},"PROFESIÓN/OFICIO:"]
["l NO SOCIO",{"$f":"B40","v":0},{"$f":"C40","v":0},"DOMICILIO REAL:"]
["l NO SOCIO",{"$f":"B40","v":0},{"$f":"C40","v":0},"CEL/TEL :"]
["l NO SOCIO",{"$f":"+IF(E48=0,0,B40)","v":0},{"$f":"+IF(E48=0,0,C40)","v":0},"EMAIL:"]
["l NO SOCIO",{"$f":"B40","v":0},{"$f":"C40","v":0},"ESTADO CIVIL:"]
["l NO SOCIO",{"$f":"IF($E49=\"CASADO/A\",B40,0)","v":0},{"$f":"IF($E49=\"CASADO/A\",C40,0)","v":0},{"$f":"IF(E49=\"CASADO/A\",\"APELLIDO/S CÓNYUGE:\",\"\")","v":""}]
["l NO SOCIO",{"$f":"IF($E49=\"CASADO/A\",B40,0)","v":0},{"$f":"IF($E49=\"CASADO/A\",C40,0)","v":0},{"$f":"IF(E49=\"CASADO/A\",\"NOMBRE/S CÓNYUGE:\",\"\")","v":""}]
["l NO SOCIO",{"$f":"IF($E49=\"CASADO/A\",B40,0)","v":0},{"$f":"IF($E49=\"CASADO/A\",C40,0)","v":0},{"$f":"IF(E49=\"CASADO/A\",\"DOC. IDENTIDAD (cónyuge) –sin puntos ni barras-:\",\"\")","v":""}]
["i ORG. REP. LEGAL/ ADM.",{"$f":"IF(E53=0,0,B40)","v":0},{"$f":"IF(E53=0,0,C40)","v":0},"NOMBRE CARGO REP. LEGAL/ ADMINISTRACIÓN QUE OCUPA:"]
["j ORG. FISCALIZ.",{"$f":"IF(OR(E54=0,E54=\"PRESCINDE ART. 9 ACTO CONSTITUIVO\"),0,B40)","v":0},{"$f":"IF(OR(F54=0,E54=\"PRESCINDE ART.9 ACTO CONSTITUIVO\"),0,C40)","v":0},"NOMBRE CARGO FISCALIZACIÓN QUE OCUPA:"]
["l NO SOCIO",{"$f":"IF(E55=0,0,B40)","v":0},{"$f":"IF(E55=0,0,C40)","v":0},"NOTA/OBSERVACIÓN -en mayúscula-:"]
["l NO SOCIO",null,null,"DOC. IDENTIDAD –sin puntos-:"]
["l NO SOCIO",{"$f":"B56","v":0},{"$f":"C56","v":0},"CUIT/CUIL –sin puntos ni barras-:"]
["l NO SOCIO",{"$f":"B56","v":0},{"$f":"C56","v":0},"FECHA DE NACIMIENTO –dd/mm/aa-:"]
["l NO SOCIO",{"$f":"B56","v":0},{"$f":"C56","v":0},"LUGAR DE NACIMIENTO:"]
["l NO SOCIO",{"$f":"B56","v":0},{"$f":"C56","v":0},"NACIONALIDAD:"]
["l NO SOCIO",{"$f":"B56","v":0},{"$f":"C56","v":0},"PROFESIÓN/OFICIO:"]
["l NO SOCIO",{"$f":"B56","v":0},{"$f":"C56","v":0},"DOMICILIO REAL:"]
["l NO SOCIO",{"$f":"B56","v":0},{"$f":"C56","v":0},"CEL/TEL :"]
["l NO SOCIO",{"$f":"+IF(E64=0,0,B56)","v":0},{"$f":"+IF(E64=0,0,C56)","v":0},"EMAIL:"]
["l NO SOCIO",{"$f":"B56","v":0},{"$f":"C56","v":0},"ESTADO CIVIL:"]
["l NO SOCIO",{"$f":"IF($E65=\"CASADO/A\",B56,0)","v":0},{"$f":"IF($E65=\"CASADO/A\",C56,0)","v":0},{"$f":"IF(E65=\"CASADO/A\",\"APELLIDO/S CÓNYUGE:\",\"\")","v":""}]
["l NO SOCIO",{"$f":"IF($E65=\"CASADO/A\",B56,0)","v":0},{"$f":"IF($E65=\"CASADO/A\",C56,0)","v":0},{"$f":"IF(E65=\"CASADO/A\",\"NOMBRE/S CÓNYUGE:\",\"\")","v":""}]
["l NO SOCIO",{"$f":"IF($E65=\"CASADO/A\",B56,0)","v":0},{"$f":"IF($E65=\"CASADO/A\",C56,0)","v":0},{"$f":"IF(E65=\"CASADO/A\",\"DOC. IDENTIDAD (cónyuge) –sin puntos ni barras-:\",\"\")","v":""}]
["i ORG. REP. LEGAL/ ADM.",{"$f":"IF(E69=0,0,B56)","v":0},{"$f":"IF(E69=0,0,C56)","v":0},"NOMBRE CARGO REP. LEGAL/ ADMINISTRACIÓN QUE OCUPA:"]
["j ORG. FISCALIZ.",{"$f":"IF(OR(E70=0,E70=\"PRESCINDE ART. 9 ACTO CONSTITUIVO\"),0,B56)","v":0},{"$f":"IF(OR(F70=0,E70=\"PRESCINDE ART.9 ACTO CONSTITUIVO\"),0,C56)","v":0},"NOMBRE CARGO FISCALIZACIÓN QUE OCUPA:"]
["l NO SOCIO",{"$f":"IF(E71=0,0,B56)","v":0},{"$f":"IF(E71=0,0,C56)","v":0},"NOTA/OBSERVACIÓN -en mayúscula-:"]
["l NO SOCIO",null,null,"DOC. IDENTIDAD –sin puntos-:"]
["l NO SOCIO",{"$f":"B72","v":0},{"$f":"C72","v":0},"CUIT/CUIL –sin puntos ni barras-:"]
["l NO SOCIO",{"$f":"B72","v":0},{"$f":"C72","v":0},"FECHA DE NACIMIENTO –dd/mm/aa-:"]
["l NO SOCIO",{"$f":"B72","v":0},{"$f":"C72","v":0},"LUGAR DE NACIMIENTO:"]
["l NO SOCIO",{"$f":"B72","v":0},{"$f":"C72","v":0},"NACIONALIDAD:"]
["l NO SOCIO",{"$f":"B72","v":0},{"$f":"C72","v":0},"PROFESIÓN/OFICIO:"]
["l NO SOCIO",{"$f":"B72","v":0},{"$f":"C72","v":0},"DOMICILIO REAL:"]
["l NO SOCIO",{"$f":"B72","v":0},{"$f":"C72","v":0},"CEL/TEL :"]
["l NO SOCIO",{"$f":"+IF(E80=0,0,B72)","v":0},{"$f":"+IF(E80=0,0,C72)","v":0},"EMAIL:"]
["l NO SOCIO",{"$f":"B72","v":0},{"$f":"C72","v":0},"ESTADO CIVIL:"]
["l NO SOCIO",{"$f":"IF($E81=\"CASADO/A\",B72,0)","v":0},{"$f":"IF($E81=\"CASADO/A\",C72,0)","v":0},{"$f":"IF(E81=\"CASADO/A\",\"APELLIDO/S CÓNYUGE:\",\"\")","v":""}]
["l NO SOCIO",{"$f":"IF($E81=\"CASADO/A\",B72,0)","v":0},{"$f":"IF($E81=\"CASADO/A\",C72,0)","v":0},{"$f":"IF(E81=\"CASADO/A\",\"NOMBRE/S CÓNYUGE:\",\"\")","v":""}]
["l NO SOCIO",{"$f":"IF($E81=\"CASADO/A\",B72,0)","v":0},{"$f":"IF($E81=\"CASADO/A\",C72,0)","v":0},{"$f":"IF(E81=\"CASADO/A\",\"DOC. IDENTIDAD (cónyuge) –sin puntos ni barras-:\",\"\")","v":""}]
["i ORG. REP. LEGAL/ ADM.",{"$f":"IF(E85=0,0,B72)","v":0},{"$f":"IF(E85=0,0,C72)","v":0},"NOMBRE CARGO REP. LEGAL/ ADMINISTRACIÓN QUE OCUPA:"]
["j ORG. FISCALIZ.",{"$f":"IF(OR(E86=0,E86=\"PRESCINDE ART. 9 ACTO CONSTITUIVO\"),0,B72)","v":0},{"$f":"IF(OR(F86=0,E86=\"PRESCINDE ART.9 ACTO CONSTITUIVO\"),0,C72)","v":0},"NOMBRE CARGO FISCALIZACIÓN QUE OCUPA:"]
["l NO SOCIO",{"$f":"IF(E87=0,0,B72)","v":0},{"$f":"IF(E87=0,0,C72)","v":0},"NOTA/OBSERVACIÓN -en mayúscula-:"]
["l NO SOCIO",null,0,"DOC. IDENTIDAD –sin puntos-:"]
["l NO SOCIO",{"$f":"B88","v":0},{"$f":"C88","v":0},"CUIT/CUIL –sin puntos ni barras-:"]
["l NO SOCIO",{"$f":"B88","v":0},{"$f":"C88","v":0},"FECHA DE NACIMIENTO –dd/mm/aa-:"]
["l NO SOCIO",{"$f":"B88","v":0},{"$f":"C88","v":0},"LUGAR DE NACIMIENTO:"]
["l NO SOCIO",{"$f":"B88","v":0},{"$f":"C88","v":0},"NACIONALIDAD:"]
["l NO SOCIO",{"$f":"B88","v":0},{"$f":"C88","v":0},"PROFESIÓN/OFICIO:"]
["l NO SOCIO",{"$f":"B88","v":0},{"$f":"C88","v":0},"DOMICILIO REAL:"]
["l NO SOCIO",{"$f":"B88","v":0},{"$f":"C88","v":0},"CEL/TEL :"]
["l NO SOCIO",{"$f":"+IF(E96=0,0,B88)","v":0},{"$f":"+IF(E96=0,0,C88)","v":0},"EMAIL:"]
["l NO SOCIO",{"$f":"B88","v":0},{"$f":"C88","v":0},"ESTADO CIVIL:"]
["l NO SOCIO",{"$f":"IF($E97=\"CASADO/A\",B88,0)","v":0},{"$f":"IF($E97=\"CASADO/A\",C88,0)","v":0},{"$f":"IF(E97=\"CASADO/A\",\"APELLIDO/S CÓNYUGE:\",\"\")","v":""}]
["l NO SOCIO",{"$f":"IF($E97=\"CASADO/A\",B88,0)","v":0},{"$f":"IF($E97=\"CASADO/A\",C88,0)","v":0},{"$f":"IF(E97=\"CASADO/A\",\"NOMBRE/S CÓNYUGE:\",\"\")","v":""}]
["l NO SOCIO",{"$f":"IF($E97=\"CASADO/A\",B88,0)","v":0},{"$f":"IF($E97=\"CASADO/A\",C88,0)","v":0},{"$f":"IF(E97=\"CASADO/A\",\"DOC. IDENTIDAD (cónyuge) –sin puntos ni barras-:\",\"\")","v":""}]
["i ORG. REP. LEGAL/ ADM.",{"$f":"IF(E101=0,0,B88)","v":0},{"$f":"IF(E101=0,0,C88)","v":0},"NOMBRE CARGO REP. LEGAL/ ADMINISTRACIÓN QUE OCUPA:"]
["j ORG. FISCALIZ.",{"$f":"IF(OR(E102=0,E102=\"PRESCINDE ART. 9 ACTO CONSTITUIVO\"),0,B88)","v":0},{"$f":"IF(OR(F102=0,E102=\"PRESCINDE ART.9 ACTO CONSTITUIVO\"),0,C88)","v":0},"NOMBRE CARGO FISCALIZACIÓN QUE OCUPA:"]
["l NO SOCIO",{"$f":"IF(E103=0,0,B88)","v":0},{"$f":"IF(E103=0,0,C88)","v":0},"NOTA/OBSERVACIÓN -en mayúscula-:"]
["l NO SOCIO",null,0,"DOC. IDENTIDAD –sin puntos-:"]
["l NO SOCIO",{"$f":"B104","v":0},{"$f":"C104","v":0},"CUIT/CUIL –sin puntos ni barras-:"]
["l NO SOCIO",{"$f":"B104","v":0},{"$f":"C104","v":0},"FECHA DE NACIMIENTO –dd/mm/aa-:"]
["l NO SOCIO",{"$f":"B104","v":0},{"$f":"C104","v":0},"LUGAR DE NACIMIENTO:"]
["l NO SOCIO",{"$f":"B104","v":0},{"$f":"C104","v":0},"NACIONALIDAD:"]
["l NO SOCIO",{"$f":"B104","v":0},{"$f":"C104","v":0},"PROFESIÓN/OFICIO:"]
["l NO SOCIO",{"$f":"B104","v":0},{"$f":"C104","v":0},"DOMICILIO REAL:"]
["l NO SOCIO",{"$f":"B104","v":0},{"$f":"C104","v":0},"CEL/TEL :"]
["l NO SOCIO",{"$f":"+IF(E112=0,0,B104)","v":0},{"$f":"+IF(E112=0,0,C104)","v":0},"EMAIL:"]
["l NO SOCIO",{"$f":"B104","v":0},{"$f":"C104","v":0},"ESTADO CIVIL:"]
["l NO SOCIO",{"$f":"IF($E113=\"CASADO/A\",B104,0)","v":0},{"$f":"IF($E113=\"CASADO/A\",C104,0)","v":0},{"$f":"IF(E113=\"CASADO/A\",\"APELLIDO/S CÓNYUGE:\",\"\")","v":""}]
["l NO SOCIO",{"$f":"IF($E113=\"CASADO/A\",B104,0)","v":0},{"$f":"IF($E113=\"CASADO/A\",C104,0)","v":0},{"$f":"IF(E113=\"CASADO/A\",\"NOMBRE/S CÓNYUGE:\",\"\")","v":""}]
["l NO SOCIO",{"$f":"IF($E113=\"CASADO/A\",B104,0)","v":0},{"$f":"IF($E113=\"CASADO/A\",C104,0)","v":0},{"$f":"IF(E113=\"CASADO/A\",\"DOC. IDENTIDAD (cónyuge) –sin puntos ni barras-:\",\"\")","v":""}]
["i ORG. REP. LEGAL/ ADM.",{"$f":"IF(E117=0,0,B104)","v":0},{"$f":"IF(E117=0,0,C104)","v":0},"NOMBRE CARGO REP. LEGAL/ ADMINISTRACIÓN QUE OCUPA:"]
["j ORG. FISCALIZ.",{"$f":"IF(OR(E118=0,E118=\"PRESCINDE ART. 9 ACTO CONSTITUIVO\"),0,B104)","v":0},{"$f":"IF(OR(F118=0,E118=\"PRESCINDE ART.9 ACTO CONSTITUIVO\"),0,C104)","v":0},"NOMBRE CARGO FISCALIZACIÓN QUE OCUPA:"]
["l NO SOCIO",{"$f":"IF(E119=0,0,B104)","v":0},{"$f":"IF(E119=0,0,C104)","v":0},"NOTA/OBSERVACIÓN -en mayúscula-:"]
["l NO SOCIO",null,0,"DOC. IDENTIDAD –sin puntos-:"]
["l NO SOCIO",{"$f":"B120","v":0},{"$f":"C120","v":0},"CUIT/CUIL –sin puntos ni barras-:"]
["l NO SOCIO",{"$f":"B120","v":0},{"$f":"C120","v":0},"FECHA DE NACIMIENTO –dd/mm/aa-:"]
["l NO SOCIO",{"$f":"B120","v":0},{"$f":"C120","v":0},"LUGAR DE NACIMIENTO:"]
["l NO SOCIO",{"$f":"B120","v":0},{"$f":"C120","v":0},"NACIONALIDAD:"]
["l NO SOCIO",{"$f":"B120","v":0},{"$f":"C120","v":0},"PROFESIÓN/OFICIO:"]
["l NO SOCIO",{"$f":"B120","v":0},{"$f":"C120","v":0},"DOMICILIO REAL:"]
["l NO SOCIO",{"$f":"B120","v":0},{"$f":"C120","v":0},"CEL/TEL :"]
["l NO SOCIO",{"$f":"+IF(E128=0,0,B120)","v":0},{"$f":"+IF(E128=0,0,C120)","v":0},"EMAIL:"]
["l NO SOCIO",{"$f":"B120","v":0},{"$f":"C120","v":0},"ESTADO CIVIL:"]
["l NO SOCIO",{"$f":"IF($E129=\"CASADO/A\",B120,0)","v":0},{"$f":"IF($E129=\"CASADO/A\",C120,0)","v":0},{"$f":"IF(E129=\"CASADO/A\",\"APELLIDO/S CÓNYUGE:\",\"\")","v":""}]
["l NO SOCIO",{"$f":"IF($E129=\"CASADO/A\",B120,0)","v":0},{"$f":"IF($E129=\"CASADO/A\",C120,0)","v":0},{"$f":"IF(E129=\"CASADO/A\",\"NOMBRE/S CÓNYUGE:\",\"\")","v":""}]
["l NO SOCIO",{"$f":"IF($E129=\"CASADO/A\",B120,0)","v":0},{"$f":"IF($E129=\"CASADO/A\",C120,0)","v":0},{"$f":"IF(E129=\"CASADO/A\",\"DOC. IDENTIDAD (cónyuge) –sin puntos ni barras-:\",\"\")","v":""}]
["i ORG. REP. LEGAL/ ADM.",{"$f":"IF(E133=0,0,B120)","v":0},{"$f":"IF(E133=0,0,C120)","v":0},"NOMBRE CARGO REP. LEGAL/ ADMINISTRACIÓN QUE OCUPA:"]
["j ORG. FISCALIZ.",{"$f":"IF(OR(E134=0,E134=\"PRESCINDE ART. 9 ACTO CONSTITUIVO\"),0,B120)","v":0},{"$f":"IF(OR(F134=0,E134=\"PRESCINDE ART.9 ACTO CONSTITUIVO\"),0,C120)","v":0},"NOMBRE CARGO FISCALIZACIÓN QUE OCUPA:"]
["l NO SOCIO",{"$f":"IF(E135=0,0,B120)","v":0},{"$f":"IF(E135=0,0,C120)","v":0},"NOTA/OBSERVACIÓN -en mayúscula-:"]
["l NO SOCIO",null,0,"DOC. IDENTIDAD –sin puntos-:"]
["l NO SOCIO",{"$f":"B136","v":0},{"$f":"C136","v":0},"CUIT/CUIL –sin puntos ni barras-:"]
["l NO SOCIO",{"$f":"B136","v":0},{"$f":"C136","v":0},"FECHA DE NACIMIENTO –dd/mm/aa-:"]
["l NO SOCIO",{"$f":"B136","v":0},{"$f":"C136","v":0},"LUGAR DE NACIMIENTO:"]
["l NO SOCIO",{"$f":"B136","v":0},{"$f":"C136","v":0},"NACIONALIDAD:"]
["l NO SOCIO",{"$f":"B136","v":0},{"$f":"C136","v":0},"PROFESIÓN/OFICIO:"]
["l NO SOCIO",{"$f":"B136","v":0},{"$f":"C136","v":0},"DOMICILIO REAL:"]
["l NO SOCIO",{"$f":"B136","v":0},{"$f":"C136","v":0},"CEL/TEL :"]
["l NO SOCIO",{"$f":"+IF(E144=0,0,B136)","v":0},{"$f":"+IF(E144=0,0,C136)","v":0},"EMAIL:"]
["l NO SOCIO",{"$f":"B136","v":0},{"$f":"C136","v":0},"ESTADO CIVIL:"]
["l NO SOCIO",{"$f":"IF($E145=\"CASADO/A\",B136,0)","v":0},{"$f":"IF($E145=\"CASADO/A\",C136,0)","v":0},{"$f":"IF(E145=\"CASADO/A\",\"APELLIDO/S CÓNYUGE:\",\"\")","v":""}]
["l NO SOCIO",{"$f":"IF($E145=\"CASADO/A\",B136,0)","v":0},{"$f":"IF($E145=\"CASADO/A\",C136,0)","v":0},{"$f":"IF(E145=\"CASADO/A\",\"NOMBRE/S CÓNYUGE:\",\"\")","v":""}]
["l NO SOCIO",{"$f":"IF($E145=\"CASADO/A\",B136,0)","v":0},{"$f":"IF($E145=\"CASADO/A\",C136,0)","v":0},{"$f":"IF(E145=\"CASADO/A\",\"DOC. IDENTIDAD (cónyuge) –sin puntos ni barras-:\",\"\")","v":""}]
["i ORG. REP. LEGAL/ ADM.",{"$f":"IF(E149=0,0,B136)","v":0},{"$f":"IF(E149=0,0,C136)","v":0},"NOMBRE CARGO REP. LEGAL/ ADMINISTRACIÓN QUE OCUPA:"]
["j ORG. FISCALIZ.",{"$f":"IF(OR(E150=0,E150=\"PRESCINDE ART. 9 ACTO CONSTITUIVO\"),0,B136)","v":0},{"$f":"IF(OR(F150=0,E150=\"PRESCINDE ART.9 ACTO CONSTITUIVO\"),0,C136)","v":0},"NOMBRE CARGO FISCALIZACIÓN QUE OCUPA:"]
["l NO SOCIO",{"$f":"IF(E151=0,0,B136)","v":0},{"$f":"IF(E151=0,0,C136)","v":0},"NOTA/OBSERVACIÓN -en mayúscula-:"]
["l NO SOCIO",null,0,"DOC. IDENTIDAD –sin puntos-:"]
["l NO SOCIO",{"$f":"B152","v":0},{"$f":"C152","v":0},"CUIT/CUIL –sin puntos ni barras-:"]
["l NO SOCIO",{"$f":"B152","v":0},{"$f":"C152","v":0},"FECHA DE NACIMIENTO –dd/mm/aa-:"]
["l NO SOCIO",{"$f":"B152","v":0},{"$f":"C152","v":0},"LUGAR DE NACIMIENTO:"]
["l NO SOCIO",{"$f":"B152","v":0},{"$f":"C152","v":0},"NACIONALIDAD:"]
["l NO SOCIO",{"$f":"B152","v":0},{"$f":"C152","v":0},"PROFESIÓN/OFICIO:"]
["l NO SOCIO",{"$f":"B152","v":0},{"$f":"C152","v":0},"DOMICILIO REAL:"]
["l NO SOCIO",{"$f":"B152","v":0},{"$f":"C152","v":0},"CEL/TEL :"]
["l NO SOCIO",{"$f":"+IF(E160=0,0,B152)","v":0},{"$f":"+IF(E160=0,0,C152)","v":0},"EMAIL:"]
["l NO SOCIO",{"$f":"B152","v":0},{"$f":"C152","v":0},"ESTADO CIVIL:"]
["l NO SOCIO",{"$f":"IF($E161=\"CASADO/A\",B152,0)","v":0},{"$f":"IF($E161=\"CASADO/A\",C152,0)","v":0},{"$f":"IF(E161=\"CASADO/A\",\"APELLIDO/S CÓNYUGE:\",\"\")","v":""}]
["l NO SOCIO",{"$f":"IF($E161=\"CASADO/A\",B152,0)","v":0},{"$f":"IF($E161=\"CASADO/A\",C152,0)","v":0},{"$f":"IF(E161=\"CASADO/A\",\"NOMBRE/S CÓNYUGE:\",\"\")","v":""}]
["l NO SOCIO",{"$f":"IF($E161=\"CASADO/A\",B152,0)","v":0},{"$f":"IF($E161=\"CASADO/A\",C152,0)","v":0},{"$f":"IF(E161=\"CASADO/A\",\"DOC. IDENTIDAD (cónyuge) –sin puntos ni barras-:\",\"\")","v":""}]
["i ORG. REP. LEGAL/ ADM.",{"$f":"IF(E165=0,0,B152)","v":0},{"$f":"IF(E165=0,0,C152)","v":0},"NOMBRE CARGO REP. LEGAL/ ADMINISTRACIÓN QUE OCUPA:"]
["j ORG. FISCALIZ.",{"$f":"IF(OR(E166=0,E166=\"PRESCINDE ART. 9 ACTO CONSTITUIVO\"),0,B152)","v":0},{"$f":"IF(OR(F166=0,E166=\"PRESCINDE ART.9 ACTO CONSTITUIVO\"),0,C152)","v":0},"NOMBRE CARGO FISCALIZACIÓN QUE OCUPA:"]
["l NO SOCIO",{"$f":"IF(E167=0,0,B152)","v":0},{"$f":"IF(E167=0,0,C152)","v":0},"NOTA/OBSERVACIÓN -en mayúscula-:"]
["l NO SOCIO",null,0,"DOC. IDENTIDAD –sin puntos-:"]
["l NO SOCIO",{"$f":"B168","v":0},{"$f":"C168","v":0},"CUIT/CUIL –sin puntos ni barras-:"]
["l NO SOCIO",{"$f":"B168","v":0},{"$f":"C168","v":0},"FECHA DE NACIMIENTO –dd/mm/aa-:"]
["l NO SOCIO",{"$f":"B168","v":0},{"$f":"C168","v":0},"LUGAR DE NACIMIENTO:"]
["l NO SOCIO",{"$f":"B168","v":0},{"$f":"C168","v":0},"NACIONALIDAD:"]
["l NO SOCIO",{"$f":"B168","v":0},{"$f":"C168","v":0},"PROFESIÓN/OFICIO:"]
["l NO SOCIO",{"$f":"B168","v":0},{"$f":"C168","v":0},"DOMICILIO REAL:"]
["l NO SOCIO",{"$f":"B168","v":0},{"$f":"C168","v":0},"CEL/TEL :"]
["l NO SOCIO",{"$f":"+IF(E176=0,0,B168)","v":0},{"$f":"+IF(E176=0,0,C168)","v":0},"EMAIL:"]
["l NO SOCIO",{"$f":"B168","v":0},{"$f":"C168","v":0},"ESTADO CIVIL:"]
["l NO SOCIO",{"$f":"IF($E177=\"CASADO/A\",B168,0)","v":0},{"$f":"IF($E177=\"CASADO/A\",C168,0)","v":0},{"$f":"IF(E177=\"CASADO/A\",\"APELLIDO/S CÓNYUGE:\",\"\")","v":""}]
["l NO SOCIO",{"$f":"IF($E177=\"CASADO/A\",B168,0)","v":0},{"$f":"IF($E177=\"CASADO/A\",C168,0)","v":0},{"$f":"IF(E177=\"CASADO/A\",\"NOMBRE/S CÓNYUGE:\",\"\")","v":""}]
["l NO SOCIO",{"$f":"IF($E177=\"CASADO/A\",B168,0)","v":0},{"$f":"IF($E177=\"CASADO/A\",C168,0)","v":0},{"$f":"IF(E177=\"CASADO/A\",\"DOC. IDENTIDAD (cónyuge) –sin puntos ni barras-:\",\"\")","v":""}]
["i ORG. REP. LEGAL/ ADM.",{"$f":"IF(E181=0,0,B168)","v":0},{"$f":"IF(E181=0,0,C168)","v":0},"NOMBRE CARGO REP. LEGAL/ ADMINISTRACIÓN QUE OCUPA:"]
["j ORG. FISCALIZ.",{"$f":"IF(OR(E182=0,E182=\"PRESCINDE ART. 9 ACTO CONSTITUIVO\"),0,B168)","v":0},{"$f":"IF(OR(F182=0,E182=\"PRESCINDE ART.9 ACTO CONSTITUIVO\"),0,C168)","v":0},"NOMBRE CARGO FISCALIZACIÓN QUE OCUPA:"]
["l NO SOCIO",{"$f":"IF(E183=0,0,B168)","v":0},{"$f":"IF(E183=0,0,C168)","v":0},"NOTA/OBSERVACIÓN -en mayúscula-:"]
["l NO SOCIO",null,0,"DOC. IDENTIDAD –sin puntos-:"]
["l NO SOCIO",{"$f":"B184","v":0},{"$f":"C184","v":0},"CUIT/CUIL –sin puntos ni barras-:"]
["l NO SOCIO",{"$f":"B184","v":0},{"$f":"C184","v":0},"FECHA DE NACIMIENTO –dd/mm/aa-:"]
["l NO SOCIO",{"$f":"B184","v":0},{"$f":"C184","v":0},"LUGAR DE NACIMIENTO:"]
["l NO SOCIO",{"$f":"B184","v":0},{"$f":"C184","v":0},"NACIONALIDAD:"]
["l NO SOCIO",{"$f":"B184","v":0},{"$f":"C184","v":0},"PROFESIÓN/OFICIO:"]
["l NO SOCIO",{"$f":"B184","v":0},{"$f":"C184","v":0},"DOMICILIO REAL:"]
["l NO SOCIO",{"$f":"B184","v":0},{"$f":"C184","v":0},"CEL/TEL :"]
["l NO SOCIO",{"$f":"+IF(E192=0,0,B184)","v":0},{"$f":"+IF(E192=0,0,C184)","v":0},"EMAIL:"]
["l NO SOCIO",{"$f":"B184","v":0},{"$f":"C184","v":0},"ESTADO CIVIL:"]
["l NO SOCIO",{"$f":"IF($E193=\"CASADO/A\",B184,0)","v":0},{"$f":"IF($E193=\"CASADO/A\",C184,0)","v":0},{"$f":"IF(E193=\"CASADO/A\",\"APELLIDO/S CÓNYUGE:\",\"\")","v":""}]
["l NO SOCIO",{"$f":"IF($E193=\"CASADO/A\",B184,0)","v":0},{"$f":"IF($E193=\"CASADO/A\",C184,0)","v":0},{"$f":"IF(E193=\"CASADO/A\",\"NOMBRE/S CÓNYUGE:\",\"\")","v":""}]
["l NO SOCIO",{"$f":"IF($E193=\"CASADO/A\",B184,0)","v":0},{"$f":"IF($E193=\"CASADO/A\",C184,0)","v":0},{"$f":"IF(E193=\"CASADO/A\",\"DOC. IDENTIDAD (cónyuge) –sin puntos ni barras-:\",\"\")","v":""}]
["i ORG. REP. LEGAL/ ADM.",{"$f":"IF(E197=0,0,B184)","v":0},{"$f":"IF(E197=0,0,C184)","v":0},"NOMBRE CARGO REP. LEGAL/ ADMINISTRACIÓN QUE OCUPA:"]
["j ORG. FISCALIZ.",{"$f":"IF(OR(E198=0,E198=\"PRESCINDE ART. 9 ACTO CONSTITUIVO\"),0,B184)","v":0},{"$f":"IF(OR(F198=0,E198=\"PRESCINDE ART.9 ACTO CONSTITUIVO\"),0,C184)","v":0},"NOMBRE CARGO FISCALIZACIÓN QUE OCUPA:"]
["l NO SOCIO",{"$f":"IF(E199=0,0,B184)","v":0},{"$f":"IF(E199=0,0,C184)","v":0},"NOTA/OBSERVACIÓN -en mayúscula-:"]
["l NO SOCIO",null,0,"DOC. IDENTIDAD –sin puntos-:"]
["l NO SOCIO",{"$f":"B200","v":0},{"$f":"C200","v":0},"CUIT/CUIL –sin puntos ni barras-:"]
["l NO SOCIO",{"$f":"B200","v":0},{"$f":"C200","v":0},"FECHA DE NACIMIENTO –dd/mm/aa-:"]
["l NO SOCIO",{"$f":"B200","v":0},{"$f":"C200","v":0},"LUGAR DE NACIMIENTO:"]
["l NO SOCIO",{"$f":"B200","v":0},{"$f":"C200","v":0},"NACIONALIDAD:"]
["l NO SOCIO",{"$f":"B200","v":0},{"$f":"C200","v":0},"PROFESIÓN/OFICIO:"]
["l NO SOCIO",{"$f":"B200","v":0},{"$f":"C200","v":0},"DOMICILIO REAL:"]
["l NO SOCIO",{"$f":"B200","v":0},{"$f":"C200","v":0},"CEL/TEL :"]
["l NO SOCIO",{"$f":"+IF(E208=0,0,B200)","v":0},{"$f":"+IF(E208=0,0,C200)","v":0},"EMAIL:"]
["l NO SOCIO",{"$f":"B200","v":0},{"$f":"C200","v":0},"ESTADO CIVIL:"]
["l NO SOCIO",{"$f":"IF($E209=\"CASADO/A\",B200,0)","v":0},{"$f":"IF($E209=\"CASADO/A\",C200,0)","v":0},{"$f":"IF(E209=\"CASADO/A\",\"APELLIDO/S CÓNYUGE:\",\"\")","v":""}]
["l NO SOCIO",{"$f":"IF($E209=\"CASADO/A\",B200,0)","v":0},{"$f":"IF($E209=\"CASADO/A\",C200,0)","v":0},{"$f":"IF(E209=\"CASADO/A\",\"NOMBRE/S CÓNYUGE:\",\"\")","v":""}]
["l NO SOCIO",{"$f":"IF($E209=\"CASADO/A\",B200,0)","v":0},{"$f":"IF($E209=\"CASADO/A\",C200,0)","v":0},{"$f":"IF(E209=\"CASADO/A\",\"DOC. IDENTIDAD (cónyuge) –sin puntos ni barras-:\",\"\")","v":""}]
["i ORG. REP. LEGAL/ ADM.",{"$f":"IF(E213=0,0,B200)","v":0},{"$f":"IF(E213=0,0,C200)","v":0},"NOMBRE CARGO REP. LEGAL/ ADMINISTRACIÓN QUE OCUPA:"]
["j ORG. FISCALIZ.",{"$f":"IF(OR(E214=0,E214=\"PRESCINDE ART. 9 ACTO CONSTITUIVO\"),0,B200)","v":0},{"$f":"IF(OR(F214=0,E214=\"PRESCINDE ART.9 ACTO CONSTITUIVO\"),0,C200)","v":0},"NOMBRE CARGO FISCALIZACIÓN QUE OCUPA:"]
["l NO SOCIO",{"$f":"IF(E215=0,0,B200)","v":0},{"$f":"IF(E215=0,0,C200)","v":0},"NOTA/OBSERVACIÓN -en mayúscula-:"]
["l NO SOCIO",null,0,"DOC. IDENTIDAD –sin puntos-:"]
["l NO SOCIO",{"$f":"B216","v":0},{"$f":"C216","v":0},"CUIT/CUIL –sin puntos ni barras-:"]
["l NO SOCIO",{"$f":"B216","v":0},{"$f":"C216","v":0},"FECHA DE NACIMIENTO –dd/mm/aa-:"]
["l NO SOCIO",{"$f":"B216","v":0},{"$f":"C216","v":0},"LUGAR DE NACIMIENTO:"]
["l NO SOCIO",{"$f":"B216","v":0},{"$f":"C216","v":0},"NACIONALIDAD:"]
["l NO SOCIO",{"$f":"B216","v":0},{"$f":"C216","v":0},"PROFESIÓN/OFICIO:"]
["l NO SOCIO",{"$f":"B216","v":0},{"$f":"C216","v":0},"DOMICILIO REAL:"]
["l NO SOCIO",{"$f":"B216","v":0},{"$f":"C216","v":0},"CEL/TEL :"]
["l NO SOCIO",{"$f":"+IF(E224=0,0,B216)","v":0},{"$f":"+IF(E224=0,0,C216)","v":0},"EMAIL:"]
["l NO SOCIO",{"$f":"B216","v":0},{"$f":"C216","v":0},"ESTADO CIVIL:"]
["l NO SOCIO",{"$f":"IF($E225=\"CASADO/A\",B216,0)","v":0},{"$f":"IF($E225=\"CASADO/A\",C216,0)","v":0},{"$f":"IF(E225=\"CASADO/A\",\"APELLIDO/S CÓNYUGE:\",\"\")","v":""}]
["l NO SOCIO",{"$f":"IF($E225=\"CASADO/A\",B216,0)","v":0},{"$f":"IF($E225=\"CASADO/A\",C216,0)","v":0},{"$f":"IF(E225=\"CASADO/A\",\"NOMBRE/S CÓNYUGE:\",\"\")","v":""}]
["l NO SOCIO",{"$f":"IF($E225=\"CASADO/A\",B216,0)","v":0},{"$f":"IF($E225=\"CASADO/A\",C216,0)","v":0},{"$f":"IF(E225=\"CASADO/A\",\"DOC. IDENTIDAD (cónyuge) –sin puntos ni barras-:\",\"\")","v":""}]
["i ORG. REP. LEGAL/ ADM.",{"$f":"IF(E229=0,0,B216)","v":0},{"$f":"IF(E229=0,0,C216)","v":0},"NOMBRE CARGO REP. LEGAL/ ADMINISTRACIÓN QUE OCUPA:"]
["j ORG. FISCALIZ.",{"$f":"IF(OR(E230=0,E230=\"PRESCINDE ART. 9 ACTO CONSTITUIVO\"),0,B216)","v":0},{"$f":"IF(OR(F230=0,E230=\"PRESCINDE ART.9 ACTO CONSTITUIVO\"),0,C216)","v":0},"NOMBRE CARGO FISCALIZACIÓN QUE OCUPA:"]
["l NO SOCIO",{"$f":"IF(E231=0,0,B216)","v":0},{"$f":"IF(E231=0,0,C216)","v":0},"NOTA/OBSERVACIÓN -en mayúscula-:"]
["l NO SOCIO",null,0,"DOC. IDENTIDAD –sin puntos-:"]
["l NO SOCIO",{"$f":"B232","v":0},{"$f":"C232","v":0},"CUIT/CUIL –sin puntos ni barras-:"]
["l NO SOCIO",{"$f":"B232","v":0},{"$f":"C232","v":0},"FECHA DE NACIMIENTO –dd/mm/aa-:"]
["l NO SOCIO",{"$f":"B232","v":0},{"$f":"C232","v":0},"LUGAR DE NACIMIENTO:"]
["l NO SOCIO",{"$f":"B232","v":0},{"$f":"C232","v":0},"NACIONALIDAD:"]
["l NO SOCIO",{"$f":"B232","v":0},{"$f":"C232","v":0},"PROFESIÓN/OFICIO:"]
["l NO SOCIO",{"$f":"B232","v":0},{"$f":"C232","v":0},"DOMICILIO REAL:"]
["l NO SOCIO",{"$f":"B232","v":0},{"$f":"C232","v":0},"CEL/TEL :"]
["l NO SOCIO",{"$f":"+IF(E240=0,0,B232)","v":0},{"$f":"+IF(E240=0,0,C232)","v":0},"EMAIL:"]
["l NO SOCIO",{"$f":"B232","v":0},{"$f":"C232","v":0},"ESTADO CIVIL:"]
["l NO SOCIO",{"$f":"IF($E241=\"CASADO/A\",B232,0)","v":0},{"$f":"IF($E241=\"CASADO/A\",C232,0)","v":0},{"$f":"IF(E241=\"CASADO/A\",\"APELLIDO/S CÓNYUGE:\",\"\")","v":""}]
["l NO SOCIO",{"$f":"IF($E241=\"CASADO/A\",B232,0)","v":0},{"$f":"IF($E241=\"CASADO/A\",C232,0)","v":0},{"$f":"IF(E241=\"CASADO/A\",\"NOMBRE/S CÓNYUGE:\",\"\")","v":""}]
["l NO SOCIO",{"$f":"IF($E241=\"CASADO/A\",B232,0)","v":0},{"$f":"IF($E241=\"CASADO/A\",C232,0)","v":0},{"$f":"IF(E241=\"CASADO/A\",\"DOC. IDENTIDAD (cónyuge) –sin puntos ni barras-:\",\"\")","v":""}]
["i ORG. REP. LEGAL/ ADM.",{"$f":"IF(E245=0,0,B232)","v":0},{"$f":"IF(E245=0,0,C232)","v":0},"NOMBRE CARGO REP. LEGAL/ ADMINISTRACIÓN QUE OCUPA:"]
["j ORG. FISCALIZ.",{"$f":"IF(OR(E246=0,E246=\"PRESCINDE ART. 9 ACTO CONSTITUIVO\"),0,B232)","v":0},{"$f":"IF(OR(F246=0,E246=\"PRESCINDE ART.9 ACTO CONSTITUIVO\"),0,C232)","v":0},"NOMBRE CARGO FISCALIZACIÓN QUE OCUPA:"]
["l NO SOCIO",{"$f":"IF(E247=0,0,B232)","v":0},{"$f":"IF(E247=0,0,C232)","v":0},"NOTA/OBSERVACIÓN -en mayúscula-:"]

{"sheet":"PREGUNTAS","index":4,"n_rows":18,"n_cols":4,"rows_kept":18,"cut":false,"hidden":false,"merged":[[7,2,7,3],[8,2,8,3],[9,2,9,3]]}
["DATOS CONSIGNADOS","CANTIDAD"]
["SOCIOS PERSONAS HUMANA CONSIGNADOS EN SOLAPA \"SOCIOS\":",{"$f":"+LISTADOS!D52","v":0},{"$f":"IF(AND(B2<14,B8=\"SI\"),\"INCOMPLETO: SE PUEDEN CARGAR MÁS SOCIOS HUMANOS EN SOLAPA SOCIOS\",\"\")","v":""}]
["SOCIOS PERSONAS JURÍDICA CONSIGNADOS EN SOLAPA \"SOCIOS\":",{"$f":"+LISTADOS!D62","v":0},{"$f":"IF(AND(B3<10,B9=\"SI\"),\"INCOMPLETO: SE PUEDEN CARGAR MÁS SOCIOS PER. JCAS EN SOLAPA SOCIOS\",\"\")","v":""}]
["NO SOCIOS INTEGRANTES DE ORGANO REP. LEGAL/ ADMINISTRATIVO EN SOLAPA \"NO SOCIOS\":",{"$f":"+LISTADOS!F54","v":0},{"$f":"IF(AND(B4<15,B10=\"SI\"),\"INCOMPLETO: SE PUEDEN CARGAR MÁS NO SOCIOS EN SOLAPA SOCIOS\",\"\")","v":""}]
[]
[]
["PREGUNTAS","RESPUESTAS"]
["¿HAY MÁS SOCIOS PERSONAS HUMANAS QUE LOS MÁXIMOS CONSIGNADOS EN SOLAPA \"SOCIOS\"?",null,{"$f":"+IF(B8=0,\"CAMPO OBLIGATORIO, CAUSAL DE RECHAZO\",\"\")","v":"CAMPO OBLIGATORIO, CAUSAL DE RECHAZO"}]
["¿HAY MÁS SOCIOS PERSONAS JURÍDICAS QUE LOS MÁXIMOS CONSIGNADOS EN SOLAPA \"SOCIOS\"?",null,{"$f":"+IF(B9=0,\"CAMPO OBLIGATORIO, CAUSAL DE RECHAZO\",\"\")","v":"CAMPO OBLIGATORIO, CAUSAL DE RECHAZO"}]
["¿HAY MÁS NO SOCIOS QUE LOS MÁXIMOS CONSIGNADOS EN SOLAPA \"NO SOCIOS\"?",null,"CAMPO OBLIGATORIO, CAUSAL DE RECHAZO"]
[]
[{"$f":"+IF(B8=\"SI\",\"INDICAR CANTIDAD TOTAL DE PERSONAS HUMANAS SOCIAS:\",\"\")","v":""},null,{"$f":"IF(B12=0,\"INCOMPLETO, CAUSAL DE RECHAZO\",IF(AND(B12>0,B12<14,B8=\"SI\"),\"SOCIOS HUMANOS MENOR AL PERMITIDO EN SOLAPA SOCIOS\",\"\"))","v":"INCOMPLETO, CAUSAL DE RECHAZO"},{"$f":"IF(AND(B8=\"NO\",B12>0),\"BORRAR NROS.\",\"\")","v":""}]
[{"$f":"+IF(B9=\"SI\",\"INDICAR CANTIDAD TOTAL DE PERSONAS JURÍDICAS SOCIAS:\",\"\")","v":""},null,{"$f":"IF(B13=0,\"INCOMPLETO, CAUSAL DE RECHAZO\",IF(AND(B13>0,B13<10,B9=\"SI\"),\"SOCIOS PERSONAS JURIDÍCAS MENOR AL PERMITIDO EN SOLAPA SOCIOS\",\"\"))","v":"INCOMPLETO, CAUSAL DE RECHAZO"},{"$f":"IF(AND(B9=\"NO\",B13>0),\"BORRAR NROS.\",\"\")","v":""}]
[{"$f":"+IF(B10=\"SI\",\"INDICAR CANTIDAD TOTAL DE NO SOCIOS QUE OCUPAN CARGOS:\",\"\")","v":""},null,{"$f":"IF(B14=0,\"INCOMPLETO, CAUSAL DE RECHAZO\",IF(AND(B14>0,B14<15,B10=\"SI\"),\"SOCIOS HUMANOS MENOR AL PERMITIDO EN SOLAPA NO SOCIOS\",\"\"))","v":"INCOMPLETO, CAUSAL DE RECHAZO"},{"$f":"IF(AND(B10=\"NO\",B14>0),\"BORRAR NROS.\",\"\")","v":""}]
[]
[{"$f":"IF(B12>14,\"POR SOCIOS HUMANOS SUPERIORES A 14, LLENAR SAS 5-SOCIOS Y NO SOCIOS ADICIONALES\",\"\")","v":""}]
[{"$f":"IF(B13>10,\"POR SOCIOS PER. JURÍDICAS SUPERIORES A 10, LLENAR SAS 5-SOCIOS Y NO SOCIOS ADICIONALES\",\"\")","v":""}]
[{"$f":"IF(B14>15,\"POR NO SOCIOS SUPERIORES A 15, LLENAR SAS 5-SOCIOS Y NO SOCIOS ADICIONALES\",\"\")","v":""}]

{"sheet":"IMPRIMIR","index":5,"n_rows":765,"n_cols":6,"rows_kept":765,"cut":false,"hidden":false,"merged":[[764,3,764,4],[756,3,756,4],[759,3,759,4],[760,3,760,4],[761,3,761,4],[762,3,762,4],[763,3,763,4],[1,0,1,4],[2,0,2,2],[0,3,0,4],[4,5,5,5],[4,0,5,0],[4,1,5,1],[4,2,5,2],[0,0,0,2],[754,3,754,4],[755,3,755,4],[757,3,757,4],[2,3,2,4],[4,3,4,4],[749,3,749,4],[750,3,750,4],[751,3,751,4],[752,3,752,4],[753,3,753,4]]}
[{"$f":"+'SOLICITUD-DATOS SOC'!A1","v":"DATOS SOCIALES "},null,null,"HOJA (FOJA) Nº: …………….."]
["Unidad de Registro Publico y Contralor de Personas Jurídicas"]
["NOMBRE DE LA SOCIEDAD:",null,null,{"$f":"+'SOLICITUD-DATOS SOC'!D4:E4","v":0}]
[null,"FECHA:",{"$f":"+'SOLICITUD-DATOS SOC'!D5","v":"00:00:00"}]
["REFER.","VINCULADOS","VINCULADOS","DATOS",null,"FILA Nº"]
[null,null,null,"CONCEPTO","COMPLETAR -EN MAYUSCULA -"]
[{"$f":"+'SOLICITUD-DATOS SOC'!A18","v":"aa GESTOR"},{"$f":"+'SOLICITUD-DATOS SOC'!B18","v":0},{"$f":"+'SOLICITUD-DATOS SOC'!C18","v":0},{"$f":"+'SOLICITUD-DATOS SOC'!D18","v":"TRAMITE QUE SE INICIA:"},{"$f":"IF('SOLICITUD-DATOS SOC'!E18=\"ELEGIR\",\"INCOMPLETO RECHAZAR\",'SOLICITUD-DATOS SOC'!E18)","v":"INCOMPLETO RECHAZAR"},1]
[{"$f":"+'SOLICITUD-DATOS SOC'!A19","v":"ab GESTOR"},{"$f":"+'SOLICITUD-DATOS SOC'!B19","v":0},{"$f":"+'SOLICITUD-DATOS SOC'!C19","v":0},{"$f":"+'SOLICITUD-DATOS SOC'!D19","v":"DOMICILIO PROCESAL CONSTITUIDO -art.40 CPCC-:"},{"$f":"IF('SOLICITUD-DATOS SOC'!E19>0,'SOLICITUD-DATOS SOC'!E19,\"INCOMPLETO RECHAZAR\")","v":"INCOMPLETO RECHAZAR"},2]
[{"$f":"+'SOLICITUD-DATOS SOC'!A20","v":"ac GESTOR"},{"$f":"+'SOLICITUD-DATOS SOC'!B20","v":0},{"$f":"+'SOLICITUD-DATOS SOC'!C20","v":0},{"$f":"+'SOLICITUD-DATOS SOC'!D20","v":"CARÁCTER DEL GESTIONANTE:"},{"$f":"IF('SOLICITUD-DATOS SOC'!E20>0,'SOLICITUD-DATOS SOC'!E20,\"INCOMPLETO RECHAZAR\")","v":"INCOMPLETO RECHAZAR"},3]
[{"$f":"+'SOLICITUD-DATOS SOC'!A21","v":"ad GESTOR"},{"$f":"+'SOLICITUD-DATOS SOC'!B21","v":0},{"$f":"+'SOLICITUD-DATOS SOC'!C21","v":0},{"$f":"+'SOLICITUD-DATOS SOC'!D21","v":"LETRADO/A/S PATROCINANTE/S:"},{"$f":"IF('SOLICITUD-DATOS SOC'!E21>0,'SOLICITUD-DATOS SOC'!E21,\"INCOMPLETO RECHAZAR\")","v":"INCOMPLETO RECHAZAR"},4]
[{"$f":"+'SOLICITUD-DATOS SOC'!A22","v":"ae GESTOR"},{"$f":"+'SOLICITUD-DATOS SOC'!B22","v":0},{"$f":"+'SOLICITUD-DATOS SOC'!C22","v":0},{"$f":"+'SOLICITUD-DATOS SOC'!D22","v":"DOC. IDENTIDAD –sin puntos-:"},{"$f":"IF('SOLICITUD-DATOS SOC'!E22>0,'SOLICITUD-DATOS SOC'!E22,\"INCOMPLETO RECHAZAR\")","v":"INCOMPLETO RECHAZAR"},5]
[{"$f":"+'SOLICITUD-DATOS SOC'!A23","v":"af GESTOR"},{"$f":"+'SOLICITUD-DATOS SOC'!B23","v":0},{"$f":"+'SOLICITUD-DATOS SOC'!C23","v":0},{"$f":"+'SOLICITUD-DATOS SOC'!D23","v":"DOMICILIO REAL -indicar Ciudad/Pcia./País"},{"$f":"IF('SOLICITUD-DATOS SOC'!E23>0,'SOLICITUD-DATOS SOC'!E23,\"INCOMPLETO RECHAZAR\")","v":"INCOMPLETO RECHAZAR"},6]
[{"$f":"+'SOLICITUD-DATOS SOC'!A24","v":"ag GESTOR"},{"$f":"+'SOLICITUD-DATOS SOC'!B24","v":0},{"$f":"+'SOLICITUD-DATOS SOC'!C24","v":0},{"$f":"+'SOLICITUD-DATOS SOC'!D24","v":"CEL/TEL -c/código de área, sin puntos o barras-:"},{"$f":"IF('SOLICITUD-DATOS SOC'!E24>0,'SOLICITUD-DATOS SOC'!E24,\"INCOMPLETO RECHAZAR\")","v":"INCOMPLETO RECHAZAR"},7]
[{"$f":"+'SOLICITUD-DATOS SOC'!A25","v":"ah GESTOR"},{"$f":"+'SOLICITUD-DATOS SOC'!B25","v":0},{"$f":"+'SOLICITUD-DATOS SOC'!C25","v":0},{"$f":"+'SOLICITUD-DATOS SOC'!D25","v":"EMAIL -OBLIGATORIO-:"},{"$f":"IF('SOLICITUD-DATOS SOC'!E25>0,'SOLICITUD-DATOS SOC'!E25,\"INCOMPLETO RECHAZAR\")","v":"INCOMPLETO RECHAZAR"},8]
[{"$f":"+'SOLICITUD-DATOS SOC'!A35","v":"b SOCIEDAD"},{"$f":"UPPER('SOLICITUD-DATOS SOC'!B35)","v":"0"},{"$f":"UPPER('SOLICITUD-DATOS SOC'!C35)","v":"0"},{"$f":"+'SOLICITUD-DATOS SOC'!D35","v":"CEL/TEL (de administración) -en su caso indicar que no posee-:"},{"$f":"IF('SOLICITUD-DATOS SOC'!E35>0,'SOLICITUD-DATOS SOC'!E35,\"INCOMPLETO RECHAZAR\")","v":"INCOMPLETO RECHAZAR"},9]
[{"$f":"+'SOLICITUD-DATOS SOC'!A36","v":"b SOCIEDAD"},{"$f":"UPPER('SOLICITUD-DATOS SOC'!B36)","v":"0"},{"$f":"UPPER('SOLICITUD-DATOS SOC'!C36)","v":"0"},{"$f":"+'SOLICITUD-DATOS SOC'!D36","v":"EMAIL (de administración)  -en su caso indicar que no posee-:"},{"$f":"IF('SOLICITUD-DATOS SOC'!E36>0,'SOLICITUD-DATOS SOC'!E36,\"INCOMPLETO RECHAZAR\")","v":"INCOMPLETO RECHAZAR"},10]
[{"$f":"+'SOLICITUD-DATOS SOC'!A30","v":"ba SOCIEDAD"},{"$f":"UPPER('SOLICITUD-DATOS SOC'!B30)","v":"0"},{"$f":"UPPER('SOLICITUD-DATOS SOC'!C30)","v":"0"},{"$f":"+'SOLICITUD-DATOS SOC'!D30","v":"DIRECCION SEDE SOCIAL:"},{"$f":"IF('SOLICITUD-DATOS SOC'!E30>0,'SOLICITUD-DATOS SOC'!E30,\"INCOMPLETO RECHAZAR\")","v":"INCOMPLETO RECHAZAR"},11]
[{"$f":"+'SOLICITUD-DATOS SOC'!A31","v":"bb SOCIEDAD"},{"$f":"UPPER('SOLICITUD-DATOS SOC'!B31)","v":"0"},{"$f":"UPPER('SOLICITUD-DATOS SOC'!C31)","v":"0"},{"$f":"+'SOLICITUD-DATOS SOC'!D31","v":"CUIT –sin puntos ni barras-:"},{"$f":"IF('SOLICITUD-DATOS SOC'!E31>0,'SOLICITUD-DATOS SOC'!E31,\"INCOMPLETO RECHAZAR\")","v":"INCOMPLETO RECHAZAR"},12]
[{"$f":"+SOCIOS!A26","v":"c SOCIO PH"},{"$f":"+SOCIOS!B26","v":0},{"$f":"+SOCIOS!C26","v":0},{"$f":"+SOCIOS!D26","v":""},{"$f":"IF(SOCIOS!E26>0,SOCIOS!E26,\"INCOMPLETO RECHAZAR\")","v":"INCOMPLETO RECHAZAR"},13]
[{"$f":"+SOCIOS!A23","v":"c SOCIO PH"},{"$f":"+SOCIOS!B23","v":0},{"$f":"+SOCIOS!C23","v":0},{"$f":"+SOCIOS!D23","v":"CEL/TEL :"},{"$f":"IF(SOCIOS!E23>0,SOCIOS!E23,\"INCOMPLETO RECHAZAR\")","v":"INCOMPLETO RECHAZAR"},14]
[{"$f":"+SOCIOS!A17","v":"c SOCIO PH"},{"$f":"+SOCIOS!B17","v":0},{"$f":"+SOCIOS!C17","v":0},{"$f":"+SOCIOS!D17","v":"CUIT/CUIL –sin puntos ni barras-:"},{"$f":"IF(SOCIOS!E17>0,SOCIOS!E17,\"INCOMPLETO RECHAZAR\")","v":"INCOMPLETO RECHAZAR"},15]
[{"$f":"+SOCIOS!A28","v":"c SOCIO PH"},{"$f":"+SOCIOS!B28","v":0},{"$f":"+SOCIOS!C28","v":0},{"$f":"+SOCIOS!D28","v":""},{"$f":"IF(SOCIOS!E28>0,SOCIOS!E28,\"INCOMPLETO RECHAZAR\")","v":"INCOMPLETO RECHAZAR"},16]
[{"$f":"+SOCIOS!A16","v":"c SOCIO PH"},{"$f":"+SOCIOS!B16","v":0},{"$f":"+SOCIOS!C16","v":0},{"$f":"+SOCIOS!D16","v":"DOC. IDENTIDAD –sin puntos-:"},{"$f":"IF(SOCIOS!E16>0,SOCIOS!E16,\"INCOMPLETO RECHAZAR\")","v":"INCOMPLETO RECHAZAR"},17]
[{"$f":"+SOCIOS!A22","v":"c SOCIO PH"},{"$f":"+SOCIOS!B22","v":0},{"$f":"+SOCIOS!C22","v":0},{"$f":"+SOCIOS!D22","v":"DOMICILIO REAL:"},{"$f":"IF(SOCIOS!E22>0,SOCIOS!E22,\"INCOMPLETO RECHAZAR\")","v":"INCOMPLETO RECHAZAR"},18]
[{"$f":"+SOCIOS!A24","v":"c SOCIO PH"},{"$f":"+SOCIOS!B24","v":0},{"$f":"+SOCIOS!C24","v":0},{"$f":"+SOCIOS!D24","v":"EMAIL:"},{"$f":"IF(SOCIOS!E24>0,SOCIOS!E24,\"INCOMPLETO RECHAZAR\")","v":"INCOMPLETO RECHAZAR"},19]
[{"$f":"+SOCIOS!A25","v":"c SOCIO PH"},{"$f":"+SOCIOS!B25","v":0},{"$f":"+SOCIOS!C25","v":0},{"$f":"+SOCIOS!D25","v":"ESTADO CIVIL:"},{"$f":"IF(SOCIOS!E25>0,SOCIOS!E25,\"INCOMPLETO RECHAZAR\")","v":"INCOMPLETO RECHAZAR"},20]
[{"$f":"+SOCIOS!A18","v":"c SOCIO PH"},{"$f":"+SOCIOS!B18","v":0},{"$f":"+SOCIOS!C18","v":0},{"$f":"+SOCIOS!D18","v":"FECHA DE NACIMIENTO –dd/mm/aa-:"},{"$f":"IF(SOCIOS!E18>0,SOCIOS!E18,\"INCOMPLETO RECHAZAR\")","v":"INCOMPLETO RECHAZAR"},21]
[{"$f":"+SOCIOS!A19","v":"c SOCIO PH"},{"$f":"+SOCIOS!B19","v":0},{"$f":"+SOCIOS!C19","v":0},{"$f":"+SOCIOS!D19","v":"LUGAR DE NACIMIENTO:"},{"$f":"IF(SOCIOS!E19>0,SOCIOS!E19,\"INCOMPLETO RECHAZAR\")","v":"INCOMPLETO RECHAZAR"},22]
[{"$f":"+SOCIOS!A20","v":"c SOCIO PH"},{"$f":"+SOCIOS!B20","v":0},{"$f":"+SOCIOS!C20","v":0},{"$f":"+SOCIOS!D20","v":"NACIONALIDAD:"},{"$f":"IF(SOCIOS!E20>0,SOCIOS!E20,\"INCOMPLETO RECHAZAR\")","v":"INCOMPLETO RECHAZAR"},23]
[{"$f":"+SOCIOS!A27","v":"c SOCIO PH"},{"$f":"+SOCIOS!B27","v":0},{"$f":"+SOCIOS!C27","v":0},{"$f":"+SOCIOS!D27","v":""},{"$f":"IF(SOCIOS!E27>0,SOCIOS!E27,\"INCOMPLETO RECHAZAR\")","v":"INCOMPLETO RECHAZAR"},24]
[{"$f":"+SOCIOS!A37","v":"c SOCIO PH"},{"$f":"+SOCIOS!B37","v":0},{"$f":"+SOCIOS!C37","v":0},{"$f":"+SOCIOS!D37","v":"NOTA/OBSERVACIÓN -en mayúscula-:"},{"$f":"IF(SOCIOS!E37>0,SOCIOS!E37,\"INCOMPLETO RECHAZAR\")","v":"INCOMPLETO RECHAZAR"},25]
[{"$f":"+SOCIOS!A21","v":"c SOCIO PH"},{"$f":"+SOCIOS!B21","v":0},{"$f":"+SOCIOS!C21","v":0},{"$f":"+SOCIOS!D21","v":"PROFESIÓN/OFICIO:"},{"$f":"IF(SOCIOS!E21>0,SOCIOS!E21,\"INCOMPLETO RECHAZAR\")","v":"INCOMPLETO RECHAZAR"},26]
[{"$f":"+SOCIOS!A48","v":"c SOCIO PH"},{"$f":"+SOCIOS!B48","v":0},{"$f":"+SOCIOS!C48","v":0},{"$f":"+SOCIOS!D48","v":""},{"$f":"IF(SOCIOS!E48>0,SOCIOS!E48,\"INCOMPLETO RECHAZAR\")","v":"INCOMPLETO RECHAZAR"},27]
[{"$f":"+SOCIOS!A45","v":"c SOCIO PH"},{"$f":"+SOCIOS!B45","v":0},{"$f":"+SOCIOS!C45","v":0},{"$f":"+SOCIOS!D45","v":"CEL/TEL :"},{"$f":"IF(SOCIOS!E45>0,SOCIOS!E45,\"INCOMPLETO RECHAZAR\")","v":"INCOMPLETO RECHAZAR"},28]
[{"$f":"+SOCIOS!A39","v":"c SOCIO PH"},{"$f":"+SOCIOS!B39","v":0},{"$f":"+SOCIOS!C39","v":0},{"$f":"+SOCIOS!D39","v":"CUIT/CUIL –sin puntos ni barras-:"},{"$f":"IF(SOCIOS!E39>0,SOCIOS!E39,\"INCOMPLETO RECHAZAR\")","v":"INCOMPLETO RECHAZAR"},29]
[{"$f":"+SOCIOS!A50","v":"c SOCIO PH"},{"$f":"+SOCIOS!B50","v":0},{"$f":"+SOCIOS!C50","v":0},{"$f":"+SOCIOS!D50","v":""},{"$f":"IF(SOCIOS!E50>0,SOCIOS!E50,\"INCOMPLETO RECHAZAR\")","v":"INCOMPLETO RECHAZAR"},30]
[{"$f":"+SOCIOS!A38","v":"c SOCIO PH"},{"$f":"+SOCIOS!B38","v":0},{"$f":"+SOCIOS!C38","v":0},{"$f":"+SOCIOS!D38","v":"DOC. IDENTIDAD –sin puntos-:"},{"$f":"IF(SOCIOS!E38>0,SOCIOS!E38,\"INCOMPLETO RECHAZAR\")","v":"INCOMPLETO RECHAZAR"},31]
[{"$f":"+SOCIOS!A44","v":"c SOCIO PH"},{"$f":"+SOCIOS!B44","v":0},{"$f":"+SOCIOS!C44","v":0},{"$f":"+SOCIOS!D44","v":"DOMICILIO REAL:"},{"$f":"IF(SOCIOS!E44>0,SOCIOS!E44,\"INCOMPLETO RECHAZAR\")","v":"INCOMPLETO RECHAZAR"},32]
[{"$f":"+SOCIOS!A46","v":"c SOCIO PH"},{"$f":"+SOCIOS!B46","v":0},{"$f":"+SOCIOS!C46","v":0},{"$f":"+SOCIOS!D46","v":"EMAIL:"},{"$f":"IF(SOCIOS!E46>0,SOCIOS!E46,\"INCOMPLETO RECHAZAR\")","v":"INCOMPLETO RECHAZAR"},33]
[{"$f":"+SOCIOS!A47","v":"c SOCIO PH"},{"$f":"+SOCIOS!B47","v":0},{"$f":"+SOCIOS!C47","v":0},{"$f":"+SOCIOS!D47","v":"ESTADO CIVIL:"},{"$f":"IF(SOCIOS!E47>0,SOCIOS!E47,\"INCOMPLETO RECHAZAR\")","v":"INCOMPLETO RECHAZAR"},34]
[{"$f":"+SOCIOS!A40","v":"c SOCIO PH"},{"$f":"+SOCIOS!B40","v":0},{"$f":"+SOCIOS!C40","v":0},{"$f":"+SOCIOS!D40","v":"FECHA DE NACIMIENTO –dd/mm/aa-:"},{"$f":"IF(SOCIOS!E40>0,SOCIOS!E40,\"INCOMPLETO RECHAZAR\")","v":"INCOMPLETO RECHAZAR"},35]
[{"$f":"+SOCIOS!A41","v":"c SOCIO PH"},{"$f":"+SOCIOS!B41","v":0},{"$f":"+SOCIOS!C41","v":0},{"$f":"+SOCIOS!D41","v":"LUGAR DE NACIMIENTO:"},{"$f":"IF(SOCIOS!E41>0,SOCIOS!E41,\"INCOMPLETO RECHAZAR\")","v":"INCOMPLETO RECHAZAR"},36]
[{"$f":"+SOCIOS!A42","v":"c SOCIO PH"},{"$f":"+SOCIOS!B42","v":0},{"$f":"+SOCIOS!C42","v":0},{"$f":"+SOCIOS!D42","v":"NACIONALIDAD:"},{"$f":"IF(SOCIOS!E42>0,SOCIOS!E42,\"INCOMPLETO RECHAZAR\")","v":"INCOMPLETO RECHAZAR"},37]
[{"$f":"+SOCIOS!A49","v":"c SOCIO PH"},{"$f":"+SOCIOS!B49","v":0},{"$f":"+SOCIOS!C49","v":0},{"$f":"+SOCIOS!D49","v":""},{"$f":"IF(SOCIOS!E49>0,SOCIOS!E49,\"INCOMPLETO RECHAZAR\")","v":"INCOMPLETO RECHAZAR"},38]
[{"$f":"+SOCIOS!A59","v":"c SOCIO PH"},{"$f":"+SOCIOS!B59","v":0},{"$f":"+SOCIOS!C59","v":0},{"$f":"+SOCIOS!D59","v":"NOTA/OBSERVACIÓN -en mayúscula-:"},{"$f":"IF(SOCIOS!E59>0,SOCIOS!E59,\"INCOMPLETO RECHAZAR\")","v":"INCOMPLETO RECHAZAR"},39]
[{"$f":"+SOCIOS!A43","v":"c SOCIO PH"},{"$f":"+SOCIOS!B43","v":0},{"$f":"+SOCIOS!C43","v":0},{"$f":"+SOCIOS!D43","v":"PROFESIÓN/OFICIO:"},{"$f":"IF(SOCIOS!E43>0,SOCIOS!E43,\"INCOMPLETO RECHAZAR\")","v":"INCOMPLETO RECHAZAR"},40]
[{"$f":"+SOCIOS!A70","v":"c SOCIO PH"},{"$f":"+SOCIOS!B70","v":0},{"$f":"+SOCIOS!C70","v":0},{"$f":"+SOCIOS!D70","v":""},{"$f":"IF(SOCIOS!E70>0,SOCIOS!E70,\"INCOMPLETO RECHAZAR\")","v":"INCOMPLETO RECHAZAR"},41]
[{"$f":"+SOCIOS!A67","v":"c SOCIO PH"},{"$f":"+SOCIOS!B67","v":0},{"$f":"+SOCIOS!C67","v":0},{"$f":"+SOCIOS!D67","v":"CEL/TEL :"},{"$f":"IF(SOCIOS!E67>0,SOCIOS!E67,\"INCOMPLETO RECHAZAR\")","v":"INCOMPLETO RECHAZAR"},42]
[{"$f":"+SOCIOS!A61","v":"c SOCIO PH"},{"$f":"+SOCIOS!B61","v":0},{"$f":"+SOCIOS!C61","v":0},{"$f":"+SOCIOS!D61","v":"CUIT/CUIL –sin puntos ni barras-:"},{"$f":"IF(SOCIOS!E61>0,SOCIOS!E61,\"INCOMPLETO RECHAZAR\")","v":"INCOMPLETO RECHAZAR"},43]
[{"$f":"+SOCIOS!A72","v":"c SOCIO PH"},{"$f":"+SOCIOS!B72","v":0},{"$f":"+SOCIOS!C72","v":0},{"$f":"+SOCIOS!D72","v":""},{"$f":"IF(SOCIOS!E72>0,SOCIOS!E72,\"INCOMPLETO RECHAZAR\")","v":"INCOMPLETO RECHAZAR"},44]
[{"$f":"+SOCIOS!A60","v":"c SOCIO PH"},{"$f":"+SOCIOS!B60","v":0},{"$f":"+SOCIOS!C60","v":0},{"$f":"+SOCIOS!D60","v":"DOC. IDENTIDAD –sin puntos-:"},{"$f":"IF(SOCIOS!E60>0,SOCIOS!E60,\"INCOMPLETO RECHAZAR\")","v":"INCOMPLETO RECHAZAR"},45]
[{"$f":"+SOCIOS!A66","v":"c SOCIO PH"},{"$f":"+SOCIOS!B66","v":0},{"$f":"+SOCIOS!C66","v":0},{"$f":"+SOCIOS!D66","v":"DOMICILIO REAL:"},{"$f":"IF(SOCIOS!E66>0,SOCIOS!E66,\"INCOMPLETO RECHAZAR\")","v":"INCOMPLETO RECHAZAR"},46]
[{"$f":"+SOCIOS!A68","v":"c SOCIO PH"},{"$f":"+SOCIOS!B68","v":0},{"$f":"+SOCIOS!C68","v":0},{"$f":"+SOCIOS!D68","v":"EMAIL:"},{"$f":"IF(SOCIOS!E68>0,SOCIOS!E68,\"INCOMPLETO RECHAZAR\")","v":"INCOMPLETO RECHAZAR"},47]
[{"$f":"+SOCIOS!A69","v":"c SOCIO PH"},{"$f":"+SOCIOS!B69","v":0},{"$f":"+SOCIOS!C69","v":0},{"$f":"+SOCIOS!D69","v":"ESTADO CIVIL:"},{"$f":"IF(SOCIOS!E69>0,SOCIOS!E69,\"INCOMPLETO RECHAZAR\")","v":"INCOMPLETO RECHAZAR"},48]
[{"$f":"+SOCIOS!A62","v":"c SOCIO PH"},{"$f":"+SOCIOS!B62","v":0},{"$f":"+SOCIOS!C62","v":0},{"$f":"+SOCIOS!D62","v":"FECHA DE NACIMIENTO –dd/mm/aa-:"},{"$f":"IF(SOCIOS!E62>0,SOCIOS!E62,\"INCOMPLETO RECHAZAR\")","v":"INCOMPLETO RECHAZAR"},49]
[{"$f":"+SOCIOS!A63","v":"c SOCIO PH"},{"$f":"+SOCIOS!B63","v":0},{"$f":"+SOCIOS!C63","v":0},{"$f":"+SOCIOS!D63","v":"LUGAR DE NACIMIENTO:"},{"$f":"IF(SOCIOS!E63>0,SOCIOS!E63,\"INCOMPLETO RECHAZAR\")","v":"INCOMPLETO RECHAZAR"},50]
[{"$f":"+SOCIOS!A64","v":"c SOCIO PH"},{"$f":"+SOCIOS!B64","v":0},{"$f":"+SOCIOS!C64","v":0},{"$f":"+SOCIOS!D64","v":"NACIONALIDAD:"},{"$f":"IF(SOCIOS!E64>0,SOCIOS!E64,\"INCOMPLETO RECHAZAR\")","v":"INCOMPLETO RECHAZAR"},51]
[{"$f":"+SOCIOS!A71","v":"c SOCIO PH"},{"$f":"+SOCIOS!B71","v":0},{"$f":"+SOCIOS!C71","v":0},{"$f":"+SOCIOS!D71","v":""},{"$f":"IF(SOCIOS!E71>0,SOCIOS!E71,\"INCOMPLETO RECHAZAR\")","v":"INCOMPLETO RECHAZAR"},52]
[{"$f":"+SOCIOS!A81","v":"c SOCIO PH"},{"$f":"+SOCIOS!B81","v":0},{"$f":"+SOCIOS!C81","v":0},{"$f":"+SOCIOS!D81","v":"NOTA/OBSERVACIÓN -en mayúscula-:"},{"$f":"IF(SOCIOS!E81>0,SOCIOS!E81,\"INCOMPLETO RECHAZAR\")","v":"INCOMPLETO RECHAZAR"},53]
[{"$f":"+SOCIOS!A65","v":"c SOCIO PH"},{"$f":"+SOCIOS!B65","v":0},{"$f":"+SOCIOS!C65","v":0},{"$f":"+SOCIOS!D65","v":"PROFESIÓN/OFICIO:"},{"$f":"IF(SOCIOS!E65>0,SOCIOS!E65,\"INCOMPLETO RECHAZAR\")","v":"INCOMPLETO RECHAZAR"},54]
[{"$f":"+SOCIOS!A92","v":"c SOCIO PH"},{"$f":"+SOCIOS!B92","v":0},{"$f":"+SOCIOS!C92","v":0},{"$f":"+SOCIOS!D92","v":""},{"$f":"IF(SOCIOS!E92>0,SOCIOS!E92,\"INCOMPLETO RECHAZAR\")","v":"INCOMPLETO RECHAZAR"},55]
[{"$f":"+SOCIOS!A89","v":"c SOCIO PH"},{"$f":"+SOCIOS!B89","v":0},{"$f":"+SOCIOS!C89","v":0},{"$f":"+SOCIOS!D89","v":"CEL/TEL :"},{"$f":"IF(SOCIOS!E89>0,SOCIOS!E89,\"INCOMPLETO RECHAZAR\")","v":"INCOMPLETO RECHAZAR"},56]
[{"$f":"+SOCIOS!A83","v":"c SOCIO PH"},{"$f":"+SOCIOS!B83","v":0},{"$f":"+SOCIOS!C83","v":0},{"$f":"+SOCIOS!D83","v":"CUIT/CUIL –sin puntos ni barras-:"},{"$f":"IF(SOCIOS!E83>0,SOCIOS!E83,\"INCOMPLETO RECHAZAR\")","v":"INCOMPLETO RECHAZAR"},57]
[{"$f":"+SOCIOS!A94","v":"c SOCIO PH"},{"$f":"+SOCIOS!B94","v":0},{"$f":"+SOCIOS!C94","v":0},{"$f":"+SOCIOS!D94","v":""},{"$f":"IF(SOCIOS!E94>0,SOCIOS!E94,\"INCOMPLETO RECHAZAR\")","v":"INCOMPLETO RECHAZAR"},58]
[{"$f":"+SOCIOS!A82","v":"c SOCIO PH"},{"$f":"+SOCIOS!B82","v":0},{"$f":"+SOCIOS!C82","v":0},{"$f":"+SOCIOS!D82","v":"DOC. IDENTIDAD –sin puntos-:"},{"$f":"IF(SOCIOS!E82>0,SOCIOS!E82,\"INCOMPLETO RECHAZAR\")","v":"INCOMPLETO RECHAZAR"},59]
[{"$f":"+SOCIOS!A88","v":"c SOCIO PH"},{"$f":"+SOCIOS!B88","v":0},{"$f":"+SOCIOS!C88","v":0},{"$f":"+SOCIOS!D88","v":"DOMICILIO REAL:"},{"$f":"IF(SOCIOS!E88>0,SOCIOS!E88,\"INCOMPLETO RECHAZAR\")","v":"INCOMPLETO RECHAZAR"},60]
[{"$f":"+SOCIOS!A90","v":"c SOCIO PH"},{"$f":"+SOCIOS!B90","v":0},{"$f":"+SOCIOS!C90","v":0},{"$f":"+SOCIOS!D90","v":"EMAIL:"},{"$f":"IF(SOCIOS!E90>0,SOCIOS!E90,\"INCOMPLETO RECHAZAR\")","v":"INCOMPLETO RECHAZAR"},61]
[{"$f":"+SOCIOS!A91","v":"c SOCIO PH"},{"$f":"+SOCIOS!B91","v":0},{"$f":"+SOCIOS!C91","v":0},{"$f":"+SOCIOS!D91","v":"ESTADO CIVIL:"},{"$f":"IF(SOCIOS!E91>0,SOCIOS!E91,\"INCOMPLETO RECHAZAR\")","v":"INCOMPLETO RECHAZAR"},62]
[{"$f":"+SOCIOS!A84","v":"c SOCIO PH"},{"$f":"+SOCIOS!B84","v":0},{"$f":"+SOCIOS!C84","v":0},{"$f":"+SOCIOS!D84","v":"FECHA DE NACIMIENTO –dd/mm/aa-:"},{"$f":"IF(SOCIOS!E84>0,SOCIOS!E84,\"INCOMPLETO RECHAZAR\")","v":"INCOMPLETO RECHAZAR"},63]
[{"$f":"+SOCIOS!A85","v":"c SOCIO PH"},{"$f":"+SOCIOS!B85","v":0},{"$f":"+SOCIOS!C85","v":0},{"$f":"+SOCIOS!D85","v":"LUGAR DE NACIMIENTO:"},{"$f":"IF(SOCIOS!E85>0,SOCIOS!E85,\"INCOMPLETO RECHAZAR\")","v":"INCOMPLETO RECHAZAR"},64]
[{"$f":"+SOCIOS!A86","v":"c SOCIO PH"},{"$f":"+SOCIOS!B86","v":0},{"$f":"+SOCIOS!C86","v":0},{"$f":"+SOCIOS!D86","v":"NACIONALIDAD:"},{"$f":"IF(SOCIOS!E86>0,SOCIOS!E86,\"INCOMPLETO RECHAZAR\")","v":"INCOMPLETO RECHAZAR"},65]
[{"$f":"+SOCIOS!A93","v":"c SOCIO PH"},{"$f":"+SOCIOS!B93","v":0},{"$f":"+SOCIOS!C93","v":0},{"$f":"+SOCIOS!D93","v":""},{"$f":"IF(SOCIOS!E93>0,SOCIOS!E93,\"INCOMPLETO RECHAZAR\")","v":"INCOMPLETO RECHAZAR"},66]
[{"$f":"+SOCIOS!A103","v":"c SOCIO PH"},{"$f":"+SOCIOS!B103","v":0},{"$f":"+SOCIOS!C103","v":0},{"$f":"+SOCIOS!D103","v":"NOTA/OBSERVACIÓN -en mayúscula-:"},{"$f":"IF(SOCIOS!E103>0,SOCIOS!E103,\"INCOMPLETO RECHAZAR\")","v":"INCOMPLETO RECHAZAR"},67]
[{"$f":"+SOCIOS!A87","v":"c SOCIO PH"},{"$f":"+SOCIOS!B87","v":0},{"$f":"+SOCIOS!C87","v":0},{"$f":"+SOCIOS!D87","v":"PROFESIÓN/OFICIO:"},{"$f":"IF(SOCIOS!E87>0,SOCIOS!E87,\"INCOMPLETO RECHAZAR\")","v":"INCOMPLETO RECHAZAR"},68]
[{"$f":"+SOCIOS!A114","v":"c SOCIO PH"},{"$f":"+SOCIOS!B114","v":0},{"$f":"+SOCIOS!C114","v":0},{"$f":"+SOCIOS!D114","v":""},{"$f":"IF(SOCIOS!E114>0,SOCIOS!E114,\"INCOMPLETO RECHAZAR\")","v":"INCOMPLETO RECHAZAR"},69]
[{"$f":"+SOCIOS!A111","v":"c SOCIO PH"},{"$f":"+SOCIOS!B111","v":0},{"$f":"+SOCIOS!C111","v":0},{"$f":"+SOCIOS!D111","v":"CEL/TEL :"},{"$f":"IF(SOCIOS!E111>0,SOCIOS!E111,\"INCOMPLETO RECHAZAR\")","v":"INCOMPLETO RECHAZAR"},70]
[{"$f":"+SOCIOS!A105","v":"c SOCIO PH"},{"$f":"+SOCIOS!B105","v":0},{"$f":"+SOCIOS!C105","v":0},{"$f":"+SOCIOS!D105","v":"CUIT/CUIL –sin puntos ni barras-:"},{"$f":"IF(SOCIOS!E105>0,SOCIOS!E105,\"INCOMPLETO RECHAZAR\")","v":"INCOMPLETO RECHAZAR"},71]
[{"$f":"+SOCIOS!A116","v":"c SOCIO PH"},{"$f":"+SOCIOS!B116","v":0},{"$f":"+SOCIOS!C116","v":0},{"$f":"+SOCIOS!D116","v":""},{"$f":"IF(SOCIOS!E116>0,SOCIOS!E116,\"INCOMPLETO RECHAZAR\")","v":"INCOMPLETO RECHAZAR"},72]
[{"$f":"+SOCIOS!A104","v":"c SOCIO PH"},{"$f":"+SOCIOS!B104","v":0},{"$f":"+SOCIOS!C104","v":0},{"$f":"+SOCIOS!D104","v":"DOC. IDENTIDAD –sin puntos-:"},{"$f":"IF(SOCIOS!E104>0,SOCIOS!E104,\"INCOMPLETO RECHAZAR\")","v":"INCOMPLETO RECHAZAR"},73]
[{"$f":"+SOCIOS!A110","v":"c SOCIO PH"},{"$f":"+SOCIOS!B110","v":0},{"$f":"+SOCIOS!C110","v":0},{"$f":"+SOCIOS!D110","v":"DOMICILIO REAL:"},{"$f":"IF(SOCIOS!E110>0,SOCIOS!E110,\"INCOMPLETO RECHAZAR\")","v":"INCOMPLETO RECHAZAR"},74]
[{"$f":"+SOCIOS!A112","v":"c SOCIO PH"},{"$f":"+SOCIOS!B112","v":0},{"$f":"+SOCIOS!C112","v":0},{"$f":"+SOCIOS!D112","v":"EMAIL:"},{"$f":"IF(SOCIOS!E112>0,SOCIOS!E112,\"INCOMPLETO RECHAZAR\")","v":"INCOMPLETO RECHAZAR"},75]
[{"$f":"+SOCIOS!A113","v":"c SOCIO PH"},{"$f":"+SOCIOS!B113","v":0},{"$f":"+SOCIOS!C113","v":0},{"$f":"+SOCIOS!D113","v":"ESTADO CIVIL:"},{"$f":"IF(SOCIOS!E113>0,SOCIOS!E113,\"INCOMPLETO RECHAZAR\")","v":"INCOMPLETO RECHAZAR"},76]
[{"$f":"+SOCIOS!A106","v":"c SOCIO PH"},{"$f":"+SOCIOS!B106","v":0},{"$f":"+SOCIOS!C106","v":0},{"$f":"+SOCIOS!D106","v":"FECHA DE NACIMIENTO –dd/mm/aa-:"},{"$f":"IF(SOCIOS!E106>0,SOCIOS!E106,\"INCOMPLETO RECHAZAR\")","v":"INCOMPLETO RECHAZAR"},77]
[{"$f":"+SOCIOS!A107","v":"c SOCIO PH"},{"$f":"+SOCIOS!B107","v":0},{"$f":"+SOCIOS!C107","v":0},{"$f":"+SOCIOS!D107","v":"LUGAR DE NACIMIENTO:"},{"$f":"IF(SOCIOS!E107>0,SOCIOS!E107,\"INCOMPLETO RECHAZAR\")","v":"INCOMPLETO RECHAZAR"},78]
[{"$f":"+SOCIOS!A108","v":"c SOCIO PH"},{"$f":"+SOCIOS!B108","v":0},{"$f":"+SOCIOS!C108","v":0},{"$f":"+SOCIOS!D108","v":"NACIONALIDAD:"},{"$f":"IF(SOCIOS!E108>0,SOCIOS!E108,\"INCOMPLETO RECHAZAR\")","v":"INCOMPLETO RECHAZAR"},79]
[{"$f":"+SOCIOS!A115","v":"c SOCIO PH"},{"$f":"+SOCIOS!B115","v":0},{"$f":"+SOCIOS!C115","v":0},{"$f":"+SOCIOS!D115","v":""},{"$f":"IF(SOCIOS!E115>0,SOCIOS!E115,\"INCOMPLETO RECHAZAR\")","v":"INCOMPLETO RECHAZAR"},80]
[{"$f":"+SOCIOS!A125","v":"c SOCIO PH"},{"$f":"+SOCIOS!B125","v":0},{"$f":"+SOCIOS!C125","v":0},{"$f":"+SOCIOS!D125","v":"NOTA/OBSERVACIÓN -en mayúscula-:"},{"$f":"IF(SOCIOS!E125>0,SOCIOS!E125,\"INCOMPLETO RECHAZAR\")","v":"INCOMPLETO RECHAZAR"},81]
[{"$f":"+SOCIOS!A109","v":"c SOCIO PH"},{"$f":"+SOCIOS!B109","v":0},{"$f":"+SOCIOS!C109","v":0},{"$f":"+SOCIOS!D109","v":"PROFESIÓN/OFICIO:"},{"$f":"IF(SOCIOS!E109>0,SOCIOS!E109,\"INCOMPLETO RECHAZAR\")","v":"INCOMPLETO RECHAZAR"},82]
[{"$f":"+SOCIOS!A136","v":"c SOCIO PH"},{"$f":"+SOCIOS!B136","v":0},{"$f":"+SOCIOS!C136","v":0},{"$f":"+SOCIOS!D136","v":""},{"$f":"IF(SOCIOS!E136>0,SOCIOS!E136,\"INCOMPLETO RECHAZAR\")","v":"INCOMPLETO RECHAZAR"},83]
[{"$f":"+SOCIOS!A133","v":"c SOCIO PH"},{"$f":"+SOCIOS!B133","v":0},{"$f":"+SOCIOS!C133","v":0},{"$f":"+SOCIOS!D133","v":"CEL/TEL :"},{"$f":"IF(SOCIOS!E133>0,SOCIOS!E133,\"INCOMPLETO RECHAZAR\")","v":"INCOMPLETO RECHAZAR"},84]
[{"$f":"+SOCIOS!A127","v":"c SOCIO PH"},{"$f":"+SOCIOS!B127","v":0},{"$f":"+SOCIOS!C127","v":0},{"$f":"+SOCIOS!D127","v":"CUIT/CUIL –sin puntos ni barras-:"},{"$f":"IF(SOCIOS!E127>0,SOCIOS!E127,\"INCOMPLETO RECHAZAR\")","v":"INCOMPLETO RECHAZAR"},85]
[{"$f":"+SOCIOS!A138","v":"c SOCIO PH"},{"$f":"+SOCIOS!B138","v":0},{"$f":"+SOCIOS!C138","v":0},{"$f":"+SOCIOS!D138","v":""},{"$f":"IF(SOCIOS!E138>0,SOCIOS!E138,\"INCOMPLETO RECHAZAR\")","v":"INCOMPLETO RECHAZAR"},86]
[{"$f":"+SOCIOS!A126","v":"c SOCIO PH"},{"$f":"+SOCIOS!B126","v":0},{"$f":"+SOCIOS!C126","v":0},{"$f":"+SOCIOS!D126","v":"DOC. IDENTIDAD –sin puntos-:"},{"$f":"IF(SOCIOS!E126>0,SOCIOS!E126,\"INCOMPLETO RECHAZAR\")","v":"INCOMPLETO RECHAZAR"},87]
[{"$f":"+SOCIOS!A132","v":"c SOCIO PH"},{"$f":"+SOCIOS!B132","v":0},{"$f":"+SOCIOS!C132","v":0},{"$f":"+SOCIOS!D132","v":"DOMICILIO REAL:"},{"$f":"IF(SOCIOS!E132>0,SOCIOS!E132,\"INCOMPLETO RECHAZAR\")","v":"INCOMPLETO RECHAZAR"},88]
[{"$f":"+SOCIOS!A134","v":"c SOCIO PH"},{"$f":"+SOCIOS!B134","v":0},{"$f":"+SOCIOS!C134","v":0},{"$f":"+SOCIOS!D134","v":"EMAIL:"},{"$f":"IF(SOCIOS!E134>0,SOCIOS!E134,\"INCOMPLETO RECHAZAR\")","v":"INCOMPLETO RECHAZAR"},89]
[{"$f":"+SOCIOS!A135","v":"c SOCIO PH"},{"$f":"+SOCIOS!B135","v":0},{"$f":"+SOCIOS!C135","v":0},{"$f":"+SOCIOS!D135","v":"ESTADO CIVIL:"},{"$f":"IF(SOCIOS!E135>0,SOCIOS!E135,\"INCOMPLETO RECHAZAR\")","v":"INCOMPLETO RECHAZAR"},90]
[{"$f":"+SOCIOS!A128","v":"c SOCIO PH"},{"$f":"+SOCIOS!B128","v":0},{"$f":"+SOCIOS!C128","v":0},{"$f":"+SOCIOS!D128","v":"FECHA DE NACIMIENTO –dd/mm/aa-:"},{"$f":"IF(SOCIOS!E128>0,SOCIOS!E128,\"INCOMPLETO RECHAZAR\")","v":"INCOMPLETO RECHAZAR"},91]
[{"$f":"+SOCIOS!A129","v":"c SOCIO PH"},{"$f":"+SOCIOS!B129","v":0},{"$f":"+SOCIOS!C129","v":0},{"$f":"+SOCIOS!D129","v":"LUGAR DE NACIMIENTO:"},{"$f":"IF(SOCIOS!E129>0,SOCIOS!E129,\"INCOMPLETO RECHAZAR\")","v":"INCOMPLETO RECHAZAR"},92]
[{"$f":"+SOCIOS!A130","v":"c SOCIO PH"},{"$f":"+SOCIOS!B130","v":0},{"$f":"+SOCIOS!C130","v":0},{"$f":"+SOCIOS!D130","v":"NACIONALIDAD:"},{"$f":"IF(SOCIOS!E130>0,SOCIOS!E130,\"INCOMPLETO RECHAZAR\")","v":"INCOMPLETO RECHAZAR"},93]
[{"$f":"+SOCIOS!A137","v":"c SOCIO PH"},{"$f":"+SOCIOS!B137","v":0},{"$f":"+SOCIOS!C137","v":0},{"$f":"+SOCIOS!D137","v":""},{"$f":"IF(SOCIOS!E137>0,SOCIOS!E137,\"INCOMPLETO RECHAZAR\")","v":"INCOMPLETO RECHAZAR"},94]
[{"$f":"+SOCIOS!A147","v":"c SOCIO PH"},{"$f":"+SOCIOS!B147","v":0},{"$f":"+SOCIOS!C147","v":0},{"$f":"+SOCIOS!D147","v":"NOTA/OBSERVACIÓN -en mayúscula-:"},{"$f":"IF(SOCIOS!E147>0,SOCIOS!E147,\"INCOMPLETO RECHAZAR\")","v":"INCOMPLETO RECHAZAR"},95]
[{"$f":"+SOCIOS!A131","v":"c SOCIO PH"},{"$f":"+SOCIOS!B131","v":0},{"$f":"+SOCIOS!C131","v":0},{"$f":"+SOCIOS!D131","v":"PROFESIÓN/OFICIO:"},{"$f":"IF(SOCIOS!E131>0,SOCIOS!E131,\"INCOMPLETO RECHAZAR\")","v":"INCOMPLETO RECHAZAR"},96]
[{"$f":"+SOCIOS!A158","v":"c SOCIO PH"},{"$f":"+SOCIOS!B158","v":0},{"$f":"+SOCIOS!C158","v":0},{"$f":"+SOCIOS!D158","v":""},{"$f":"IF(SOCIOS!E158>0,SOCIOS!E158,\"INCOMPLETO RECHAZAR\")","v":"INCOMPLETO RECHAZAR"},97]
[{"$f":"+SOCIOS!A155","v":"c SOCIO PH"},{"$f":"+SOCIOS!B155","v":0},{"$f":"+SOCIOS!C155","v":0},{"$f":"+SOCIOS!D155","v":"CEL/TEL :"},{"$f":"IF(SOCIOS!E155>0,SOCIOS!E155,\"INCOMPLETO RECHAZAR\")","v":"INCOMPLETO RECHAZAR"},98]
[{"$f":"+SOCIOS!A149","v":"c SOCIO PH"},{"$f":"+SOCIOS!B149","v":0},{"$f":"+SOCIOS!C149","v":0},{"$f":"+SOCIOS!D149","v":"CUIT/CUIL –sin puntos ni barras-:"},{"$f":"IF(SOCIOS!E149>0,SOCIOS!E149,\"INCOMPLETO RECHAZAR\")","v":"INCOMPLETO RECHAZAR"},99]
[{"$f":"+SOCIOS!A160","v":"c SOCIO PH"},{"$f":"+SOCIOS!B160","v":0},{"$f":"+SOCIOS!C160","v":0},{"$f":"+SOCIOS!D160","v":""},{"$f":"IF(SOCIOS!E160>0,SOCIOS!E160,\"INCOMPLETO RECHAZAR\")","v":"INCOMPLETO RECHAZAR"},100]
[{"$f":"+SOCIOS!A148","v":"c SOCIO PH"},{"$f":"+SOCIOS!B148","v":0},{"$f":"+SOCIOS!C148","v":0},{"$f":"+SOCIOS!D148","v":"DOC. IDENTIDAD –sin puntos-:"},{"$f":"IF(SOCIOS!E148>0,SOCIOS!E148,\"INCOMPLETO RECHAZAR\")","v":"INCOMPLETO RECHAZAR"},101]
[{"$f":"+SOCIOS!A154","v":"c SOCIO PH"},{"$f":"+SOCIOS!B154","v":0},{"$f":"+SOCIOS!C154","v":0},{"$f":"+SOCIOS!D154","v":"DOMICILIO REAL:"},{"$f":"IF(SOCIOS!E154>0,SOCIOS!E154,\"INCOMPLETO RECHAZAR\")","v":"INCOMPLETO RECHAZAR"},102]
[{"$f":"+SOCIOS!A156","v":"c SOCIO PH"},{"$f":"+SOCIOS!B156","v":0},{"$f":"+SOCIOS!C156","v":0},{"$f":"+SOCIOS!D156","v":"EMAIL:"},{"$f":"IF(SOCIOS!E156>0,SOCIOS!E156,\"INCOMPLETO RECHAZAR\")","v":"INCOMPLETO RECHAZAR"},103]
[{"$f":"+SOCIOS!A157","v":"c SOCIO PH"},{"$f":"+SOCIOS!B157","v":0},{"$f":"+SOCIOS!C157","v":0},{"$f":"+SOCIOS!D157","v":"ESTADO CIVIL:"},{"$f":"IF(SOCIOS!E157>0,SOCIOS!E157,\"INCOMPLETO RECHAZAR\")","v":"INCOMPLETO RECHAZAR"},104]
[{"$f":"+SOCIOS!A150","v":"c SOCIO PH"},{"$f":"+SOCIOS!B150","v":0},{"$f":"+SOCIOS!C150","v":0},{"$f":"+SOCIOS!D150","v":"FECHA DE NACIMIENTO –dd/mm/aa-:"},{"$f":"IF(SOCIOS!E150>0,SOCIOS!E150,\"INCOMPLETO RECHAZAR\")","v":"INCOMPLETO RECHAZAR"},105]
[{"$f":"+SOCIOS!A151","v":"c SOCIO PH"},{"$f":"+SOCIOS!B151","v":0},{"$f":"+SOCIOS!C151","v":0},{"$f":"+SOCIOS!D151","v":"LUGAR DE NACIMIENTO:"},{"$f":"IF(SOCIOS!E151>0,SOCIOS!E151,\"INCOMPLETO RECHAZAR\")","v":"INCOMPLETO RECHAZAR"},106]
[{"$f":"+SOCIOS!A152","v":"c SOCIO PH"},{"$f":"+SOCIOS!B152","v":0},{"$f":"+SOCIOS!C152","v":0},{"$f":"+SOCIOS!D152","v":"NACIONALIDAD:"},{"$f":"IF(SOCIOS!E152>0,SOCIOS!E152,\"INCOMPLETO RECHAZAR\")","v":"INCOMPLETO RECHAZAR"},107]
[{"$f":"+SOCIOS!A159","v":"c SOCIO PH"},{"$f":"+SOCIOS!B159","v":0},{"$f":"+SOCIOS!C159","v":0},{"$f":"+SOCIOS!D159","v":""},{"$f":"IF(SOCIOS!E159>0,SOCIOS!E159,\"INCOMPLETO RECHAZAR\")","v":"INCOMPLETO RECHAZAR"},108]
[{"$f":"+SOCIOS!A169","v":"c SOCIO PH"},{"$f":"+SOCIOS!B169","v":0},{"$f":"+SOCIOS!C169","v":0},{"$f":"+SOCIOS!D169","v":"NOTA/OBSERVACIÓN -en mayúscula-:"},{"$f":"IF(SOCIOS!E169>0,SOCIOS!E169,\"INCOMPLETO RECHAZAR\")","v":"INCOMPLETO RECHAZAR"},109]
[{"$f":"+SOCIOS!A153","v":"c SOCIO PH"},{"$f":"+SOCIOS!B153","v":0},{"$f":"+SOCIOS!C153","v":0},{"$f":"+SOCIOS!D153","v":"PROFESIÓN/OFICIO:"},{"$f":"IF(SOCIOS!E153>0,SOCIOS!E153,\"INCOMPLETO RECHAZAR\")","v":"INCOMPLETO RECHAZAR"},110]
[{"$f":"+SOCIOS!A180","v":"c SOCIO PH"},{"$f":"+SOCIOS!B180","v":0},{"$f":"+SOCIOS!C180","v":0},{"$f":"+SOCIOS!D180","v":""},{"$f":"IF(SOCIOS!E180>0,SOCIOS!E180,\"INCOMPLETO RECHAZAR\")","v":"INCOMPLETO RECHAZAR"},111]
[{"$f":"+SOCIOS!A177","v":"c SOCIO PH"},{"$f":"+SOCIOS!B177","v":0},{"$f":"+SOCIOS!C177","v":0},{"$f":"+SOCIOS!D177","v":"CEL/TEL :"},{"$f":"IF(SOCIOS!E177>0,SOCIOS!E177,\"INCOMPLETO RECHAZAR\")","v":"INCOMPLETO RECHAZAR"},112]
[{"$f":"+SOCIOS!A171","v":"c SOCIO PH"},{"$f":"+SOCIOS!B171","v":0},{"$f":"+SOCIOS!C171","v":0},{"$f":"+SOCIOS!D171","v":"CUIT/CUIL –sin puntos ni barras-:"},{"$f":"IF(SOCIOS!E171>0,SOCIOS!E171,\"INCOMPLETO RECHAZAR\")","v":"INCOMPLETO RECHAZAR"},113]
[{"$f":"+SOCIOS!A182","v":"c SOCIO PH"},{"$f":"+SOCIOS!B182","v":0},{"$f":"+SOCIOS!C182","v":0},{"$f":"+SOCIOS!D182","v":""},{"$f":"IF(SOCIOS!E182>0,SOCIOS!E182,\"INCOMPLETO RECHAZAR\")","v":"INCOMPLETO RECHAZAR"},114]
[{"$f":"+SOCIOS!A170","v":"c SOCIO PH"},{"$f":"+SOCIOS!B170","v":0},{"$f":"+SOCIOS!C170","v":0},{"$f":"+SOCIOS!D170","v":"DOC. IDENTIDAD –sin puntos-:"},{"$f":"IF(SOCIOS!E170>0,SOCIOS!E170,\"INCOMPLETO RECHAZAR\")","v":"INCOMPLETO RECHAZAR"},115]
[{"$f":"+SOCIOS!A176","v":"c SOCIO PH"},{"$f":"+SOCIOS!B176","v":0},{"$f":"+SOCIOS!C176","v":0},{"$f":"+SOCIOS!D176","v":"DOMICILIO REAL:"},{"$f":"IF(SOCIOS!E176>0,SOCIOS!E176,\"INCOMPLETO RECHAZAR\")","v":"INCOMPLETO RECHAZAR"},116]
[{"$f":"+SOCIOS!A178","v":"c SOCIO PH"},{"$f":"+SOCIOS!B178","v":0},{"$f":"+SOCIOS!C178","v":0},{"$f":"+SOCIOS!D178","v":"EMAIL:"},{"$f":"IF(SOCIOS!E178>0,SOCIOS!E178,\"INCOMPLETO RECHAZAR\")","v":"INCOMPLETO RECHAZAR"},117]
[{"$f":"+SOCIOS!A179","v":"c SOCIO PH"},{"$f":"+SOCIOS!B179","v":0},{"$f":"+SOCIOS!C179","v":0},{"$f":"+SOCIOS!D179","v":"ESTADO CIVIL:"},{"$f":"IF(SOCIOS!E179>0,SOCIOS!E179,\"INCOMPLETO RECHAZAR\")","v":"INCOMPLETO RECHAZAR"},118]
[{"$f":"+SOCIOS!A172","v":"c SOCIO PH"},{"$f":"+SOCIOS!B172","v":0},{"$f":"+SOCIOS!C172","v":0},{"$f":"+SOCIOS!D172","v":"FECHA DE NACIMIENTO –dd/mm/aa-:"},{"$f":"IF(SOCIOS!E172>0,SOCIOS!E172,\"INCOMPLETO RECHAZAR\")","v":"INCOMPLETO RECHAZAR"},119]
[{"$f":"+SOCIOS!A173","v":"c SOCIO PH"},{"$f":"+SOCIOS!B173","v":0},{"$f":"+SOCIOS!C173","v":0},{"$f":"+SOCIOS!D173","v":"LUGAR DE NACIMIENTO:"},{"$f":"IF(SOCIOS!E173>0,SOCIOS!E173,\"INCOMPLETO RECHAZAR\")","v":"INCOMPLETO RECHAZAR"},120]
[{"$f":"+SOCIOS!A174","v":"c SOCIO PH"},{"$f":"+SOCIOS!B174","v":0},{"$f":"+SOCIOS!C174","v":0},{"$f":"+SOCIOS!D174","v":"NACIONALIDAD:"},{"$f":"IF(SOCIOS!E174>0,SOCIOS!E174,\"INCOMPLETO RECHAZAR\")","v":"INCOMPLETO RECHAZAR"},121]
[{"$f":"+SOCIOS!A181","v":"c SOCIO PH"},{"$f":"+SOCIOS!B181","v":0},{"$f":"+SOCIOS!C181","v":0},{"$f":"+SOCIOS!D181","v":""},{"$f":"IF(SOCIOS!E181>0,SOCIOS!E181,\"INCOMPLETO RECHAZAR\")","v":"INCOMPLETO RECHAZAR"},122]
[{"$f":"+SOCIOS!A191","v":"c SOCIO PH"},{"$f":"+SOCIOS!B191","v":0},{"$f":"+SOCIOS!C191","v":0},{"$f":"+SOCIOS!D191","v":"NOTA/OBSERVACIÓN -en mayúscula-:"},{"$f":"IF(SOCIOS!E191>0,SOCIOS!E191,\"INCOMPLETO RECHAZAR\")","v":"INCOMPLETO RECHAZAR"},123]
[{"$f":"+SOCIOS!A175","v":"c SOCIO PH"},{"$f":"+SOCIOS!B175","v":0},{"$f":"+SOCIOS!C175","v":0},{"$f":"+SOCIOS!D175","v":"PROFESIÓN/OFICIO:"},{"$f":"IF(SOCIOS!E175>0,SOCIOS!E175,\"INCOMPLETO RECHAZAR\")","v":"INCOMPLETO RECHAZAR"},124]
[{"$f":"+SOCIOS!A202","v":"c SOCIO PH"},{"$f":"+SOCIOS!B202","v":0},{"$f":"+SOCIOS!C202","v":0},{"$f":"+SOCIOS!D202","v":""},{"$f":"IF(SOCIOS!E202>0,SOCIOS!E202,\"INCOMPLETO RECHAZAR\")","v":"INCOMPLETO RECHAZAR"},125]
[{"$f":"+SOCIOS!A199","v":"c SOCIO PH"},{"$f":"+SOCIOS!B199","v":0},{"$f":"+SOCIOS!C199","v":0},{"$f":"+SOCIOS!D199","v":"CEL/TEL :"},{"$f":"IF(SOCIOS!E199>0,SOCIOS!E199,\"INCOMPLETO RECHAZAR\")","v":"INCOMPLETO RECHAZAR"},126]
[{"$f":"+SOCIOS!A193","v":"c SOCIO PH"},{"$f":"+SOCIOS!B193","v":0},{"$f":"+SOCIOS!C193","v":0},{"$f":"+SOCIOS!D193","v":"CUIT/CUIL –sin puntos ni barras-:"},{"$f":"IF(SOCIOS!E193>0,SOCIOS!E193,\"INCOMPLETO RECHAZAR\")","v":"INCOMPLETO RECHAZAR"},127]
[{"$f":"+SOCIOS!A204","v":"c SOCIO PH"},{"$f":"+SOCIOS!B204","v":0},{"$f":"+SOCIOS!C204","v":0},{"$f":"+SOCIOS!D204","v":""},{"$f":"IF(SOCIOS!E204>0,SOCIOS!E204,\"INCOMPLETO RECHAZAR\")","v":"INCOMPLETO RECHAZAR"},128]
[{"$f":"+SOCIOS!A192","v":"c SOCIO PH"},{"$f":"+SOCIOS!B192","v":0},{"$f":"+SOCIOS!C192","v":0},{"$f":"+SOCIOS!D192","v":"DOC. IDENTIDAD –sin puntos-:"},{"$f":"IF(SOCIOS!E192>0,SOCIOS!E192,\"INCOMPLETO RECHAZAR\")","v":"INCOMPLETO RECHAZAR"},129]
[{"$f":"+SOCIOS!A198","v":"c SOCIO PH"},{"$f":"+SOCIOS!B198","v":0},{"$f":"+SOCIOS!C198","v":0},{"$f":"+SOCIOS!D198","v":"DOMICILIO REAL:"},{"$f":"IF(SOCIOS!E198>0,SOCIOS!E198,\"INCOMPLETO RECHAZAR\")","v":"INCOMPLETO RECHAZAR"},130]
[{"$f":"+SOCIOS!A200","v":"c SOCIO PH"},{"$f":"+SOCIOS!B200","v":0},{"$f":"+SOCIOS!C200","v":0},{"$f":"+SOCIOS!D200","v":"EMAIL:"},{"$f":"IF(SOCIOS!E200>0,SOCIOS!E200,\"INCOMPLETO RECHAZAR\")","v":"INCOMPLETO RECHAZAR"},131]
[{"$f":"+SOCIOS!A201","v":"c SOCIO PH"},{"$f":"+SOCIOS!B201","v":0},{"$f":"+SOCIOS!C201","v":0},{"$f":"+SOCIOS!D201","v":"ESTADO CIVIL:"},{"$f":"IF(SOCIOS!E201>0,SOCIOS!E201,\"INCOMPLETO RECHAZAR\")","v":"INCOMPLETO RECHAZAR"},132]
[{"$f":"+SOCIOS!A194","v":"c SOCIO PH"},{"$f":"+SOCIOS!B194","v":0},{"$f":"+SOCIOS!C194","v":0},{"$f":"+SOCIOS!D194","v":"FECHA DE NACIMIENTO –dd/mm/aa-:"},{"$f":"IF(SOCIOS!E194>0,SOCIOS!E194,\"INCOMPLETO RECHAZAR\")","v":"INCOMPLETO RECHAZAR"},133]
[{"$f":"+SOCIOS!A195","v":"c SOCIO PH"},{"$f":"+SOCIOS!B195","v":0},{"$f":"+SOCIOS!C195","v":0},{"$f":"+SOCIOS!D195","v":"LUGAR DE NACIMIENTO:"},{"$f":"IF(SOCIOS!E195>0,SOCIOS!E195,\"INCOMPLETO RECHAZAR\")","v":"INCOMPLETO RECHAZAR"},134]
[{"$f":"+SOCIOS!A196","v":"c SOCIO PH"},{"$f":"+SOCIOS!B196","v":0},{"$f":"+SOCIOS!C196","v":0},{"$f":"+SOCIOS!D196","v":"NACIONALIDAD:"},{"$f":"IF(SOCIOS!E196>0,SOCIOS!E196,\"INCOMPLETO RECHAZAR\")","v":"INCOMPLETO RECHAZAR"},135]
[{"$f":"+SOCIOS!A203","v":"c SOCIO PH"},{"$f":"+SOCIOS!B203","v":0},{"$f":"+SOCIOS!C203","v":0},{"$f":"+SOCIOS!D203","v":""},{"$f":"IF(SOCIOS!E203>0,SOCIOS!E203,\"INCOMPLETO RECHAZAR\")","v":"INCOMPLETO RECHAZAR"},136]
[{"$f":"+SOCIOS!A213","v":"c SOCIO PH"},{"$f":"+SOCIOS!B213","v":0},{"$f":"+SOCIOS!C213","v":0},{"$f":"+SOCIOS!D213","v":"NOTA/OBSERVACIÓN -en mayúscula-:"},{"$f":"IF(SOCIOS!E213>0,SOCIOS!E213,\"INCOMPLETO RECHAZAR\")","v":"INCOMPLETO RECHAZAR"},137]
[{"$f":"+SOCIOS!A197","v":"c SOCIO PH"},{"$f":"+SOCIOS!B197","v":0},{"$f":"+SOCIOS!C197","v":0},{"$f":"+SOCIOS!D197","v":"PROFESIÓN/OFICIO:"},{"$f":"IF(SOCIOS!E197>0,SOCIOS!E197,\"INCOMPLETO RECHAZAR\")","v":"INCOMPLETO RECHAZAR"},138]
[{"$f":"+SOCIOS!A224","v":"c SOCIO PH"},{"$f":"+SOCIOS!B224","v":0},{"$f":"+SOCIOS!C224","v":0},{"$f":"+SOCIOS!D224","v":""},{"$f":"IF(SOCIOS!E224>0,SOCIOS!E224,\"INCOMPLETO RECHAZAR\")","v":"INCOMPLETO RECHAZAR"},139]
[{"$f":"+SOCIOS!A221","v":"c SOCIO PH"},{"$f":"+SOCIOS!B221","v":0},{"$f":"+SOCIOS!C221","v":0},{"$f":"+SOCIOS!D221","v":"CEL/TEL :"},{"$f":"IF(SOCIOS!E221>0,SOCIOS!E221,\"INCOMPLETO RECHAZAR\")","v":"INCOMPLETO RECHAZAR"},140]
[{"$f":"+SOCIOS!A215","v":"c SOCIO PH"},{"$f":"+SOCIOS!B215","v":0},{"$f":"+SOCIOS!C215","v":0},{"$f":"+SOCIOS!D215","v":"CUIT/CUIL –sin puntos ni barras-:"},{"$f":"IF(SOCIOS!E215>0,SOCIOS!E215,\"INCOMPLETO RECHAZAR\")","v":"INCOMPLETO RECHAZAR"},141]
[{"$f":"+SOCIOS!A226","v":"c SOCIO PH"},{"$f":"+SOCIOS!B226","v":0},{"$f":"+SOCIOS!C226","v":0},{"$f":"+SOCIOS!D226","v":""},{"$f":"IF(SOCIOS!E226>0,SOCIOS!E226,\"INCOMPLETO RECHAZAR\")","v":"INCOMPLETO RECHAZAR"},142]
[{"$f":"+SOCIOS!A214","v":"c SOCIO PH"},{"$f":"+SOCIOS!B214","v":0},{"$f":"+SOCIOS!C214","v":0},{"$f":"+SOCIOS!D214","v":"DOC. IDENTIDAD –sin puntos-:"},{"$f":"IF(SOCIOS!E214>0,SOCIOS!E214,\"INCOMPLETO RECHAZAR\")","v":"INCOMPLETO RECHAZAR"},143]
[{"$f":"+SOCIOS!A220","v":"c SOCIO PH"},{"$f":"+SOCIOS!B220","v":0},{"$f":"+SOCIOS!C220","v":0},{"$f":"+SOCIOS!D220","v":"DOMICILIO REAL:"},{"$f":"IF(SOCIOS!E220>0,SOCIOS!E220,\"INCOMPLETO RECHAZAR\")","v":"INCOMPLETO RECHAZAR"},144]
[{"$f":"+SOCIOS!A222","v":"c SOCIO PH"},{"$f":"+SOCIOS!B222","v":0},{"$f":"+SOCIOS!C222","v":0},{"$f":"+SOCIOS!D222","v":"EMAIL:"},{"$f":"IF(SOCIOS!E222>0,SOCIOS!E222,\"INCOMPLETO RECHAZAR\")","v":"INCOMPLETO RECHAZAR"},145]
[{"$f":"+SOCIOS!A223","v":"c SOCIO PH"},{"$f":"+SOCIOS!B223","v":0},{"$f":"+SOCIOS!C223","v":0},{"$f":"+SOCIOS!D223","v":"ESTADO CIVIL:"},{"$f":"IF(SOCIOS!E223>0,SOCIOS!E223,\"INCOMPLETO RECHAZAR\")","v":"INCOMPLETO RECHAZAR"},146]
[{"$f":"+SOCIOS!A216","v":"c SOCIO PH"},{"$f":"+SOCIOS!B216","v":0},{"$f":"+SOCIOS!C216","v":0},{"$f":"+SOCIOS!D216","v":"FECHA DE NACIMIENTO –dd/mm/aa-:"},{"$f":"IF(SOCIOS!E216>0,SOCIOS!E216,\"INCOMPLETO RECHAZAR\")","v":"INCOMPLETO RECHAZAR"},147]
[{"$f":"+SOCIOS!A217","v":"c SOCIO PH"},{"$f":"+SOCIOS!B217","v":0},{"$f":"+SOCIOS!C217","v":0},{"$f":"+SOCIOS!D217","v":"LUGAR DE NACIMIENTO:"},{"$f":"IF(SOCIOS!E217>0,SOCIOS!E217,\"INCOMPLETO RECHAZAR\")","v":"INCOMPLETO RECHAZAR"},148]
[{"$f":"+SOCIOS!A218","v":"c SOCIO PH"},{"$f":"+SOCIOS!B218","v":0},{"$f":"+SOCIOS!C218","v":0},{"$f":"+SOCIOS!D218","v":"NACIONALIDAD:"},{"$f":"IF(SOCIOS!E218>0,SOCIOS!E218,\"INCOMPLETO RECHAZAR\")","v":"INCOMPLETO RECHAZAR"},149]
[{"$f":"+SOCIOS!A225","v":"c SOCIO PH"},{"$f":"+SOCIOS!B225","v":0},{"$f":"+SOCIOS!C225","v":0},{"$f":"+SOCIOS!D225","v":""},{"$f":"IF(SOCIOS!E225>0,SOCIOS!E225,\"INCOMPLETO RECHAZAR\")","v":"INCOMPLETO RECHAZAR"},150]
[{"$f":"+SOCIOS!A235","v":"c SOCIO PH"},{"$f":"+SOCIOS!B235","v":0},{"$f":"+SOCIOS!C235","v":0},{"$f":"+SOCIOS!D235","v":"NOTA/OBSERVACIÓN -en mayúscula-:"},{"$f":"IF(SOCIOS!E235>0,SOCIOS!E235,\"INCOMPLETO RECHAZAR\")","v":"INCOMPLETO RECHAZAR"},151]
[{"$f":"+SOCIOS!A219","v":"c SOCIO PH"},{"$f":"+SOCIOS!B219","v":0},{"$f":"+SOCIOS!C219","v":0},{"$f":"+SOCIOS!D219","v":"PROFESIÓN/OFICIO:"},{"$f":"IF(SOCIOS!E219>0,SOCIOS!E219,\"INCOMPLETO RECHAZAR\")","v":"INCOMPLETO RECHAZAR"},152]
[{"$f":"+SOCIOS!A246","v":"c SOCIO PH"},{"$f":"+SOCIOS!B246","v":0},{"$f":"+SOCIOS!C246","v":0},{"$f":"+SOCIOS!D246","v":""},{"$f":"IF(SOCIOS!E246>0,SOCIOS!E246,\"INCOMPLETO RECHAZAR\")","v":"INCOMPLETO RECHAZAR"},153]
[{"$f":"+SOCIOS!A243","v":"c SOCIO PH"},{"$f":"+SOCIOS!B243","v":0},{"$f":"+SOCIOS!C243","v":0},{"$f":"+SOCIOS!D243","v":"CEL/TEL :"},{"$f":"IF(SOCIOS!E243>0,SOCIOS!E243,\"INCOMPLETO RECHAZAR\")","v":"INCOMPLETO RECHAZAR"},154]
[{"$f":"+SOCIOS!A237","v":"c SOCIO PH"},{"$f":"+SOCIOS!B237","v":0},{"$f":"+SOCIOS!C237","v":0},{"$f":"+SOCIOS!D237","v":"CUIT/CUIL –sin puntos ni barras-:"},{"$f":"IF(SOCIOS!E237>0,SOCIOS!E237,\"INCOMPLETO RECHAZAR\")","v":"INCOMPLETO RECHAZAR"},155]
[{"$f":"+SOCIOS!A248","v":"c SOCIO PH"},{"$f":"+SOCIOS!B248","v":0},{"$f":"+SOCIOS!C248","v":0},{"$f":"+SOCIOS!D248","v":""},{"$f":"IF(SOCIOS!E248>0,SOCIOS!E248,\"INCOMPLETO RECHAZAR\")","v":"INCOMPLETO RECHAZAR"},156]
[{"$f":"+SOCIOS!A236","v":"c SOCIO PH"},{"$f":"+SOCIOS!B236","v":0},{"$f":"+SOCIOS!C236","v":0},{"$f":"+SOCIOS!D236","v":"DOC. IDENTIDAD –sin puntos-:"},{"$f":"IF(SOCIOS!E236>0,SOCIOS!E236,\"INCOMPLETO RECHAZAR\")","v":"INCOMPLETO RECHAZAR"},157]
[{"$f":"+SOCIOS!A242","v":"c SOCIO PH"},{"$f":"+SOCIOS!B242","v":0},{"$f":"+SOCIOS!C242","v":0},{"$f":"+SOCIOS!D242","v":"DOMICILIO REAL:"},{"$f":"IF(SOCIOS!E242>0,SOCIOS!E242,\"INCOMPLETO RECHAZAR\")","v":"INCOMPLETO RECHAZAR"},158]
[{"$f":"+SOCIOS!A244","v":"c SOCIO PH"},{"$f":"+SOCIOS!B244","v":0},{"$f":"+SOCIOS!C244","v":0},{"$f":"+SOCIOS!D244","v":"EMAIL:"},{"$f":"IF(SOCIOS!E244>0,SOCIOS!E244,\"INCOMPLETO RECHAZAR\")","v":"INCOMPLETO RECHAZAR"},159]
[{"$f":"+SOCIOS!A245","v":"c SOCIO PH"},{"$f":"+SOCIOS!B245","v":0},{"$f":"+SOCIOS!C245","v":0},{"$f":"+SOCIOS!D245","v":"ESTADO CIVIL:"},{"$f":"IF(SOCIOS!E245>0,SOCIOS!E245,\"INCOMPLETO RECHAZAR\")","v":"INCOMPLETO RECHAZAR"},160]
[{"$f":"+SOCIOS!A238","v":"c SOCIO PH"},{"$f":"+SOCIOS!B238","v":0},{"$f":"+SOCIOS!C238","v":0},{"$f":"+SOCIOS!D238","v":"FECHA DE NACIMIENTO –dd/mm/aa-:"},{"$f":"IF(SOCIOS!E238>0,SOCIOS!E238,\"INCOMPLETO RECHAZAR\")","v":"INCOMPLETO RECHAZAR"},161]
[{"$f":"+SOCIOS!A239","v":"c SOCIO PH"},{"$f":"+SOCIOS!B239","v":0},{"$f":"+SOCIOS!C239","v":0},{"$f":"+SOCIOS!D239","v":"LUGAR DE NACIMIENTO:"},{"$f":"IF(SOCIOS!E239>0,SOCIOS!E239,\"INCOMPLETO RECHAZAR\")","v":"INCOMPLETO RECHAZAR"},162]
[{"$f":"+SOCIOS!A240","v":"c SOCIO PH"},{"$f":"+SOCIOS!B240","v":0},{"$f":"+SOCIOS!C240","v":0},{"$f":"+SOCIOS!D240","v":"NACIONALIDAD:"},{"$f":"IF(SOCIOS!E240>0,SOCIOS!E240,\"INCOMPLETO RECHAZAR\")","v":"INCOMPLETO RECHAZAR"},163]
[{"$f":"+SOCIOS!A247","v":"c SOCIO PH"},{"$f":"+SOCIOS!B247","v":0},{"$f":"+SOCIOS!C247","v":0},{"$f":"+SOCIOS!D247","v":""},{"$f":"IF(SOCIOS!E247>0,SOCIOS!E247,\"INCOMPLETO RECHAZAR\")","v":"INCOMPLETO RECHAZAR"},164]
[{"$f":"+SOCIOS!A257","v":"c SOCIO PH"},{"$f":"+SOCIOS!B257","v":0},{"$f":"+SOCIOS!C257","v":0},{"$f":"+SOCIOS!D257","v":"NOTA/OBSERVACIÓN -en mayúscula-:"},{"$f":"IF(SOCIOS!E257>0,SOCIOS!E257,\"INCOMPLETO RECHAZAR\")","v":"INCOMPLETO RECHAZAR"},165]
[{"$f":"+SOCIOS!A241","v":"c SOCIO PH"},{"$f":"+SOCIOS!B241","v":0},{"$f":"+SOCIOS!C241","v":0},{"$f":"+SOCIOS!D241","v":"PROFESIÓN/OFICIO:"},{"$f":"IF(SOCIOS!E241>0,SOCIOS!E241,\"INCOMPLETO RECHAZAR\")","v":"INCOMPLETO RECHAZAR"},166]
[{"$f":"+SOCIOS!A268","v":"c SOCIO PH"},{"$f":"+SOCIOS!B268","v":0},{"$f":"+SOCIOS!C268","v":0},{"$f":"+SOCIOS!D268","v":""},{"$f":"IF(SOCIOS!E268>0,SOCIOS!E268,\"INCOMPLETO RECHAZAR\")","v":"INCOMPLETO RECHAZAR"},167]
[{"$f":"+SOCIOS!A265","v":"c SOCIO PH"},{"$f":"+SOCIOS!B265","v":0},{"$f":"+SOCIOS!C265","v":0},{"$f":"+SOCIOS!D265","v":"CEL/TEL :"},{"$f":"IF(SOCIOS!E265>0,SOCIOS!E265,\"INCOMPLETO RECHAZAR\")","v":"INCOMPLETO RECHAZAR"},168]
[{"$f":"+SOCIOS!A259","v":"c SOCIO PH"},{"$f":"+SOCIOS!B259","v":0},{"$f":"+SOCIOS!C259","v":0},{"$f":"+SOCIOS!D259","v":"CUIT/CUIL –sin puntos ni barras-:"},{"$f":"IF(SOCIOS!E259>0,SOCIOS!E259,\"INCOMPLETO RECHAZAR\")","v":"INCOMPLETO RECHAZAR"},169]
[{"$f":"+SOCIOS!A270","v":"c SOCIO PH"},{"$f":"+SOCIOS!B270","v":0},{"$f":"+SOCIOS!C270","v":0},{"$f":"+SOCIOS!D270","v":""},{"$f":"IF(SOCIOS!E270>0,SOCIOS!E270,\"INCOMPLETO RECHAZAR\")","v":"INCOMPLETO RECHAZAR"},170]
[{"$f":"+SOCIOS!A258","v":"c SOCIO PH"},{"$f":"+SOCIOS!B258","v":0},{"$f":"+SOCIOS!C258","v":0},{"$f":"+SOCIOS!D258","v":"DOC. IDENTIDAD –sin puntos-:"},{"$f":"IF(SOCIOS!E258>0,SOCIOS!E258,\"INCOMPLETO RECHAZAR\")","v":"INCOMPLETO RECHAZAR"},171]
[{"$f":"+SOCIOS!A264","v":"c SOCIO PH"},{"$f":"+SOCIOS!B264","v":0},{"$f":"+SOCIOS!C264","v":0},{"$f":"+SOCIOS!D264","v":"DOMICILIO REAL:"},{"$f":"IF(SOCIOS!E264>0,SOCIOS!E264,\"INCOMPLETO RECHAZAR\")","v":"INCOMPLETO RECHAZAR"},172]
[{"$f":"+SOCIOS!A266","v":"c SOCIO PH"},{"$f":"+SOCIOS!B266","v":0},{"$f":"+SOCIOS!C266","v":0},{"$f":"+SOCIOS!D266","v":"EMAIL:"},{"$f":"IF(SOCIOS!E266>0,SOCIOS!E266,\"INCOMPLETO RECHAZAR\")","v":"INCOMPLETO RECHAZAR"},173]
[{"$f":"+SOCIOS!A267","v":"c SOCIO PH"},{"$f":"+SOCIOS!B267","v":0},{"$f":"+SOCIOS!C267","v":0},{"$f":"+SOCIOS!D267","v":"ESTADO CIVIL:"},{"$f":"IF(SOCIOS!E267>0,SOCIOS!E267,\"INCOMPLETO RECHAZAR\")","v":"INCOMPLETO RECHAZAR"},174]
[{"$f":"+SOCIOS!A260","v":"c SOCIO PH"},{"$f":"+SOCIOS!B260","v":0},{"$f":"+SOCIOS!C260","v":0},{"$f":"+SOCIOS!D260","v":"FECHA DE NACIMIENTO –dd/mm/aa-:"},{"$f":"IF(SOCIOS!E260>0,SOCIOS!E260,\"INCOMPLETO RECHAZAR\")","v":"INCOMPLETO RECHAZAR"},175]
[{"$f":"+SOCIOS!A261","v":"c SOCIO PH"},{"$f":"+SOCIOS!B261","v":0},{"$f":"+SOCIOS!C261","v":0},{"$f":"+SOCIOS!D261","v":"LUGAR DE NACIMIENTO:"},{"$f":"IF(SOCIOS!E261>0,SOCIOS!E261,\"INCOMPLETO RECHAZAR\")","v":"INCOMPLETO RECHAZAR"},176]
[{"$f":"+SOCIOS!A262","v":"c SOCIO PH"},{"$f":"+SOCIOS!B262","v":0},{"$f":"+SOCIOS!C262","v":0},{"$f":"+SOCIOS!D262","v":"NACIONALIDAD:"},{"$f":"IF(SOCIOS!E262>0,SOCIOS!E262,\"INCOMPLETO RECHAZAR\")","v":"INCOMPLETO RECHAZAR"},177]
[{"$f":"+SOCIOS!A269","v":"c SOCIO PH"},{"$f":"+SOCIOS!B269","v":0},{"$f":"+SOCIOS!C269","v":0},{"$f":"+SOCIOS!D269","v":""},{"$f":"IF(SOCIOS!E269>0,SOCIOS!E269,\"INCOMPLETO RECHAZAR\")","v":"INCOMPLETO RECHAZAR"},178]
[{"$f":"+SOCIOS!A279","v":"c SOCIO PH"},{"$f":"+SOCIOS!B279","v":0},{"$f":"+SOCIOS!C279","v":0},{"$f":"+SOCIOS!D279","v":"NOTA/OBSERVACIÓN -en mayúscula-:"},{"$f":"IF(SOCIOS!E279>0,SOCIOS!E279,\"INCOMPLETO RECHAZAR\")","v":"INCOMPLETO RECHAZAR"},179]
[{"$f":"+SOCIOS!A263","v":"c SOCIO PH"},{"$f":"+SOCIOS!B263","v":0},{"$f":"+SOCIOS!C263","v":0},{"$f":"+SOCIOS!D263","v":"PROFESIÓN/OFICIO:"},{"$f":"IF(SOCIOS!E263>0,SOCIOS!E263,\"INCOMPLETO RECHAZAR\")","v":"INCOMPLETO RECHAZAR"},180]
[{"$f":"+SOCIOS!A290","v":"c SOCIO PH"},{"$f":"+SOCIOS!B290","v":0},{"$f":"+SOCIOS!C290","v":0},{"$f":"+SOCIOS!D290","v":""},{"$f":"IF(SOCIOS!E290>0,SOCIOS!E290,\"INCOMPLETO RECHAZAR\")","v":"INCOMPLETO RECHAZAR"},181]
[{"$f":"+SOCIOS!A287","v":"c SOCIO PH"},{"$f":"+SOCIOS!B287","v":0},{"$f":"+SOCIOS!C287","v":0},{"$f":"+SOCIOS!D287","v":"CEL/TEL :"},{"$f":"IF(SOCIOS!E287>0,SOCIOS!E287,\"INCOMPLETO RECHAZAR\")","v":"INCOMPLETO RECHAZAR"},182]
[{"$f":"+SOCIOS!A281","v":"c SOCIO PH"},{"$f":"+SOCIOS!B281","v":0},{"$f":"+SOCIOS!C281","v":0},{"$f":"+SOCIOS!D281","v":"CUIT/CUIL –sin puntos ni barras-:"},{"$f":"IF(SOCIOS!E281>0,SOCIOS!E281,\"INCOMPLETO RECHAZAR\")","v":"INCOMPLETO RECHAZAR"},183]
[{"$f":"+SOCIOS!A292","v":"c SOCIO PH"},{"$f":"+SOCIOS!B292","v":0},{"$f":"+SOCIOS!C292","v":0},{"$f":"+SOCIOS!D292","v":""},{"$f":"IF(SOCIOS!E292>0,SOCIOS!E292,\"INCOMPLETO RECHAZAR\")","v":"INCOMPLETO RECHAZAR"},184]
[{"$f":"+SOCIOS!A280","v":"c SOCIO PH"},{"$f":"+SOCIOS!B280","v":0},{"$f":"+SOCIOS!C280","v":0},{"$f":"+SOCIOS!D280","v":"DOC. IDENTIDAD –sin puntos-:"},{"$f":"IF(SOCIOS!E280>0,SOCIOS!E280,\"INCOMPLETO RECHAZAR\")","v":"INCOMPLETO RECHAZAR"},185]
[{"$f":"+SOCIOS!A286","v":"c SOCIO PH"},{"$f":"+SOCIOS!B286","v":0},{"$f":"+SOCIOS!C286","v":0},{"$f":"+SOCIOS!D286","v":"DOMICILIO REAL:"},{"$f":"IF(SOCIOS!E286>0,SOCIOS!E286,\"INCOMPLETO RECHAZAR\")","v":"INCOMPLETO RECHAZAR"},186]
[{"$f":"+SOCIOS!A288","v":"c SOCIO PH"},{"$f":"+SOCIOS!B288","v":0},{"$f":"+SOCIOS!C288","v":0},{"$f":"+SOCIOS!D288","v":"EMAIL:"},{"$f":"IF(SOCIOS!E288>0,SOCIOS!E288,\"INCOMPLETO RECHAZAR\")","v":"INCOMPLETO RECHAZAR"},187]
[{"$f":"+SOCIOS!A289","v":"c SOCIO PH"},{"$f":"+SOCIOS!B289","v":0},{"$f":"+SOCIOS!C289","v":0},{"$f":"+SOCIOS!D289","v":"ESTADO CIVIL:"},{"$f":"IF(SOCIOS!E289>0,SOCIOS!E289,\"INCOMPLETO RECHAZAR\")","v":"INCOMPLETO RECHAZAR"},188]
[{"$f":"+SOCIOS!A282","v":"c SOCIO PH"},{"$f":"+SOCIOS!B282","v":0},{"$f":"+SOCIOS!C282","v":0},{"$f":"+SOCIOS!D282","v":"FECHA DE NACIMIENTO –dd/mm/aa-:"},{"$f":"IF(SOCIOS!E282>0,SOCIOS!E282,\"INCOMPLETO RECHAZAR\")","v":"INCOMPLETO RECHAZAR"},189]
[{"$f":"+SOCIOS!A283","v":"c SOCIO PH"},{"$f":"+SOCIOS!B283","v":0},{"$f":"+SOCIOS!C283","v":0},{"$f":"+SOCIOS!D283","v":"LUGAR DE NACIMIENTO:"},{"$f":"IF(SOCIOS!E283>0,SOCIOS!E283,\"INCOMPLETO RECHAZAR\")","v":"INCOMPLETO RECHAZAR"},190]
[{"$f":"+SOCIOS!A284","v":"c SOCIO PH"},{"$f":"+SOCIOS!B284","v":0},{"$f":"+SOCIOS!C284","v":0},{"$f":"+SOCIOS!D284","v":"NACIONALIDAD:"},{"$f":"IF(SOCIOS!E284>0,SOCIOS!E284,\"INCOMPLETO RECHAZAR\")","v":"INCOMPLETO RECHAZAR"},191]
[{"$f":"+SOCIOS!A291","v":"c SOCIO PH"},{"$f":"+SOCIOS!B291","v":0},{"$f":"+SOCIOS!C291","v":0},{"$f":"+SOCIOS!D291","v":""},{"$f":"IF(SOCIOS!E291>0,SOCIOS!E291,\"INCOMPLETO RECHAZAR\")","v":"INCOMPLETO RECHAZAR"},192]
[{"$f":"+SOCIOS!A301","v":"c SOCIO PH"},{"$f":"+SOCIOS!B301","v":0},{"$f":"+SOCIOS!C301","v":0},{"$f":"+SOCIOS!D301","v":"NOTA/OBSERVACIÓN -en mayúscula-:"},{"$f":"IF(SOCIOS!E301>0,SOCIOS!E301,\"INCOMPLETO RECHAZAR\")","v":"INCOMPLETO RECHAZAR"},193]
[{"$f":"+SOCIOS!A285","v":"c SOCIO PH"},{"$f":"+SOCIOS!B285","v":0},{"$f":"+SOCIOS!C285","v":0},{"$f":"+SOCIOS!D285","v":"PROFESIÓN/OFICIO:"},{"$f":"IF(SOCIOS!E285>0,SOCIOS!E285,\"INCOMPLETO RECHAZAR\")","v":"INCOMPLETO RECHAZAR"},194]
[{"$f":"+SOCIOS!A312","v":"c SOCIO PH"},{"$f":"+SOCIOS!B312","v":0},{"$f":"+SOCIOS!C312","v":0},{"$f":"+SOCIOS!D312","v":""},{"$f":"IF(SOCIOS!E312>0,SOCIOS!E312,\"INCOMPLETO RECHAZAR\")","v":"INCOMPLETO RECHAZAR"},195]
[{"$f":"+SOCIOS!A309","v":"c SOCIO PH"},{"$f":"+SOCIOS!B309","v":0},{"$f":"+SOCIOS!C309","v":0},{"$f":"+SOCIOS!D309","v":"CEL/TEL :"},{"$f":"IF(SOCIOS!E309>0,SOCIOS!E309,\"INCOMPLETO RECHAZAR\")","v":"INCOMPLETO RECHAZAR"},196]
[{"$f":"+SOCIOS!A303","v":"c SOCIO PH"},{"$f":"+SOCIOS!B303","v":0},{"$f":"+SOCIOS!C303","v":0},{"$f":"+SOCIOS!D303","v":"CUIT/CUIL –sin puntos ni barras-:"},{"$f":"IF(SOCIOS!E303>0,SOCIOS!E303,\"INCOMPLETO RECHAZAR\")","v":"INCOMPLETO RECHAZAR"},197]
[{"$f":"+SOCIOS!A314","v":"c SOCIO PH"},{"$f":"+SOCIOS!B314","v":0},{"$f":"+SOCIOS!C314","v":0},{"$f":"+SOCIOS!D314","v":""},{"$f":"IF(SOCIOS!E314>0,SOCIOS!E314,\"INCOMPLETO RECHAZAR\")","v":"INCOMPLETO RECHAZAR"},198]
[{"$f":"+SOCIOS!A302","v":"c SOCIO PH"},{"$f":"+SOCIOS!B302","v":0},{"$f":"+SOCIOS!C302","v":0},{"$f":"+SOCIOS!D302","v":"DOC. IDENTIDAD –sin puntos-:"},{"$f":"IF(SOCIOS!E302>0,SOCIOS!E302,\"INCOMPLETO RECHAZAR\")","v":"INCOMPLETO RECHAZAR"},199]
[{"$f":"+SOCIOS!A308","v":"c SOCIO PH"},{"$f":"+SOCIOS!B308","v":0},{"$f":"+SOCIOS!C308","v":0},{"$f":"+SOCIOS!D308","v":"DOMICILIO REAL:"},{"$f":"IF(SOCIOS!E308>0,SOCIOS!E308,\"INCOMPLETO RECHAZAR\")","v":"INCOMPLETO RECHAZAR"},200]
[{"$f":"+SOCIOS!A310","v":"c SOCIO PH"},{"$f":"+SOCIOS!B310","v":0},{"$f":"+SOCIOS!C310","v":0},{"$f":"+SOCIOS!D310","v":"EMAIL:"},{"$f":"IF(SOCIOS!E310>0,SOCIOS!E310,\"INCOMPLETO RECHAZAR\")","v":"INCOMPLETO RECHAZAR"},201]
[{"$f":"+SOCIOS!A311","v":"c SOCIO PH"},{"$f":"+SOCIOS!B311","v":0},{"$f":"+SOCIOS!C311","v":0},{"$f":"+SOCIOS!D311","v":"ESTADO CIVIL:"},{"$f":"IF(SOCIOS!E311>0,SOCIOS!E311,\"INCOMPLETO RECHAZAR\")","v":"INCOMPLETO RECHAZAR"},202]
[{"$f":"+SOCIOS!A304","v":"c SOCIO PH"},{"$f":"+SOCIOS!B304","v":0},{"$f":"+SOCIOS!C304","v":0},{"$f":"+SOCIOS!D304","v":"FECHA DE NACIMIENTO –dd/mm/aa-:"},{"$f":"IF(SOCIOS!E304>0,SOCIOS!E304,\"INCOMPLETO RECHAZAR\")","v":"INCOMPLETO RECHAZAR"},203]
[{"$f":"+SOCIOS!A305","v":"c SOCIO PH"},{"$f":"+SOCIOS!B305","v":0},{"$f":"+SOCIOS!C305","v":0},{"$f":"+SOCIOS!D305","v":"LUGAR DE NACIMIENTO:"},{"$f":"IF(SOCIOS!E305>0,SOCIOS!E305,\"INCOMPLETO RECHAZAR\")","v":"INCOMPLETO RECHAZAR"},204]
[{"$f":"+SOCIOS!A306","v":"c SOCIO PH"},{"$f":"+SOCIOS!B306","v":0},{"$f":"+SOCIOS!C306","v":0},{"$f":"+SOCIOS!D306","v":"NACIONALIDAD:"},{"$f":"IF(SOCIOS!E306>0,SOCIOS!E306,\"INCOMPLETO RECHAZAR\")","v":"INCOMPLETO RECHAZAR"},205]
[{"$f":"+SOCIOS!A313","v":"c SOCIO PH"},{"$f":"+SOCIOS!B313","v":0},{"$f":"+SOCIOS!C313","v":0},{"$f":"+SOCIOS!D313","v":""},{"$f":"IF(SOCIOS!E313>0,SOCIOS!E313,\"INCOMPLETO RECHAZAR\")","v":"INCOMPLETO RECHAZAR"},206]
[{"$f":"+SOCIOS!A323","v":"c SOCIO PH"},{"$f":"+SOCIOS!B323","v":0},{"$f":"+SOCIOS!C323","v":0},{"$f":"+SOCIOS!D323","v":"NOTA/OBSERVACIÓN -en mayúscula-:"},{"$f":"IF(SOCIOS!E323>0,SOCIOS!E323,\"INCOMPLETO RECHAZAR\")","v":"INCOMPLETO RECHAZAR"},207]
[{"$f":"+SOCIOS!A307","v":"c SOCIO PH"},{"$f":"+SOCIOS!B307","v":0},{"$f":"+SOCIOS!C307","v":0},{"$f":"+SOCIOS!D307","v":"PROFESIÓN/OFICIO:"},{"$f":"IF(SOCIOS!E307>0,SOCIOS!E307,\"INCOMPLETO RECHAZAR\")","v":"INCOMPLETO RECHAZAR"},208]
[{"$f":"+SOCIOS!G21","v":"c SOCIO PJ"},{"$f":"+SOCIOS!H21","v":0},{"$f":"+SOCIOS!H21","v":0},{"$f":"+SOCIOS!I21","v":"APELLIDO/S, NOMBRE/S,  DNI Y CARGO DE CADA MIEMBRO DE SU ADMINISTRACIÓN:"},{"$f":"IF(SOCIOS!J21>0,SOCIOS!J21,\"INCOMPLETO RECHAZAR\")","v":"INCOMPLETO RECHAZAR"},209]
[{"$f":"+SOCIOS!G24","v":"c SOCIO PJ"},{"$f":"+SOCIOS!H24","v":0},{"$f":"+SOCIOS!H24","v":0},{"$f":"+SOCIOS!I24","v":"CEL/TEL :"},{"$f":"IF(SOCIOS!J24>0,SOCIOS!J24,\"INCOMPLETO RECHAZAR\")","v":"INCOMPLETO RECHAZAR"},210]
[{"$f":"+SOCIOS!G16","v":"c SOCIO PJ"},{"$f":"+SOCIOS!H16","v":0},{"$f":"+SOCIOS!H16","v":0},{"$f":"+SOCIOS!I16","v":"CUIT –sin puntos ni barras-:"},{"$f":"IF(SOCIOS!J16>0,SOCIOS!J16,\"INCOMPLETO RECHAZAR\")","v":"INCOMPLETO RECHAZAR"},211]
[{"$f":"+SOCIOS!G19","v":"c SOCIO PJ"},{"$f":"+SOCIOS!H19","v":0},{"$f":"+SOCIOS!H19","v":0},{"$f":"+SOCIOS!I19","v":"DATOS DE RESOLUCIÓN Y FECHA DE INSCRIPCIÓN:"},{"$f":"IF(SOCIOS!J19>0,SOCIOS!J19,\"INCOMPLETO RECHAZAR\")","v":"INCOMPLETO RECHAZAR"},212]
[{"$f":"+SOCIOS!G22","v":"c SOCIO PJ"},{"$f":"+SOCIOS!H22","v":0},{"$f":"+SOCIOS!H22","v":0},{"$f":"+SOCIOS!I22","v":"DOMICILIO SOCIAL:"},{"$f":"IF(SOCIOS!J22>0,SOCIOS!J22,\"INCOMPLETO RECHAZAR\")","v":"INCOMPLETO RECHAZAR"},213]
[{"$f":"+SOCIOS!G20","v":"c SOCIO PJ"},{"$f":"+SOCIOS!H20","v":0},{"$f":"+SOCIOS!H20","v":0},{"$f":"+SOCIOS!I20","v":"FECHA DE INSCRIPCION:"},{"$f":"IF(SOCIOS!J20>0,SOCIOS!J20,\"INCOMPLETO RECHAZAR\")","v":"INCOMPLETO RECHAZAR"},214]
[{"$f":"+SOCIOS!G32","v":"c SOCIO PJ"},{"$f":"+SOCIOS!H32","v":0},{"$f":"+SOCIOS!H32","v":0},{"$f":"+SOCIOS!I32","v":"NOTA/OBSERVACIÓN -en mayúscula-:"},{"$f":"IF(SOCIOS!J32>0,SOCIOS!J32,\"INCOMPLETO RECHAZAR\")","v":"INCOMPLETO RECHAZAR"},215]
[{"$f":"+SOCIOS!G25","v":"c SOCIO PJ"},{"$f":"+SOCIOS!H25","v":0},{"$f":"+SOCIOS!H25","v":0},{"$f":"+SOCIOS!I25","v":"OBJETO PRINCIPAL (EN FORMA RESUMIDA):"},{"$f":"IF(SOCIOS!J25>0,SOCIOS!J25,\"INCOMPLETO RECHAZAR\")","v":"INCOMPLETO RECHAZAR"},216]
[{"$f":"+SOCIOS!G18","v":"c SOCIO PJ"},{"$f":"+SOCIOS!H18","v":0},{"$f":"+SOCIOS!H18","v":0},{"$f":"+SOCIOS!I18","v":"ORGANISMO /s DONDE SE INSCRIBIÓ CONSTITUCIÓN (INDICAR LOCALIDAD/PCIA DEL ORG) -si no se inscribió poner: NO INSCRIPTO/A:"},{"$f":"IF(SOCIOS!J18>0,SOCIOS!J18,\"INCOMPLETO RECHAZAR\")","v":"INCOMPLETO RECHAZAR"},217]
[{"$f":"+SOCIOS!G23","v":"c SOCIO PJ"},{"$f":"+SOCIOS!H23","v":0},{"$f":"+SOCIOS!H23","v":0},{"$f":"+SOCIOS!I23","v":"SEDE SOCIAL:"},{"$f":"IF(SOCIOS!J23>0,SOCIOS!J23,\"INCOMPLETO RECHAZAR\")","v":"INCOMPLETO RECHAZAR"},218]
[{"$f":"+SOCIOS!G17","v":"c SOCIO PJ"},{"$f":"+SOCIOS!H17","v":0},{"$f":"+SOCIOS!H17","v":0},{"$f":"+SOCIOS!I17","v":"TIPO DE PERSONA JCA -sociedad, asociación, mutual, etc-:"},{"$f":"IF(SOCIOS!J17>0,SOCIOS!J17,\"INCOMPLETO RECHAZAR\")","v":"INCOMPLETO RECHAZAR"},219]
[{"$f":"+SOCIOS!G38","v":"c SOCIO PJ"},{"$f":"+SOCIOS!H38","v":0},{"$f":"+SOCIOS!H38","v":0},{"$f":"+SOCIOS!I38","v":"APELLIDO/S, NOMBRE/S,  DNI Y CARGO DE CADA MIEMBRO DE SU ADMINISTRACIÓN:"},{"$f":"IF(SOCIOS!J38>0,SOCIOS!J38,\"INCOMPLETO RECHAZAR\")","v":"INCOMPLETO RECHAZAR"},220]
[{"$f":"+SOCIOS!G41","v":"c SOCIO PJ"},{"$f":"+SOCIOS!H41","v":0},{"$f":"+SOCIOS!H41","v":0},{"$f":"+SOCIOS!I41","v":"CEL/TEL :"},{"$f":"IF(SOCIOS!J41>0,SOCIOS!J41,\"INCOMPLETO RECHAZAR\")","v":"INCOMPLETO RECHAZAR"},221]
[{"$f":"+SOCIOS!G33","v":"c SOCIO PJ"},{"$f":"+SOCIOS!H33","v":0},{"$f":"+SOCIOS!H33","v":0},{"$f":"+SOCIOS!I33","v":"CUIT –sin puntos ni barras-:"},{"$f":"IF(SOCIOS!J33>0,SOCIOS!J33,\"INCOMPLETO RECHAZAR\")","v":"INCOMPLETO RECHAZAR"},222]
[{"$f":"+SOCIOS!G36","v":"c SOCIO PJ"},{"$f":"+SOCIOS!H36","v":0},{"$f":"+SOCIOS!H36","v":0},{"$f":"+SOCIOS!I36","v":"DATOS DE RESOLUCIÓN Y FECHA DE INSCRIPCIÓN:"},{"$f":"IF(SOCIOS!J36>0,SOCIOS!J36,\"INCOMPLETO RECHAZAR\")","v":"INCOMPLETO RECHAZAR"},223]
[{"$f":"+SOCIOS!G39","v":"c SOCIO PJ"},{"$f":"+SOCIOS!H39","v":0},{"$f":"+SOCIOS!H39","v":0},{"$f":"+SOCIOS!I39","v":"DOMICILIO SOCIAL:"},{"$f":"IF(SOCIOS!J39>0,SOCIOS!J39,\"INCOMPLETO RECHAZAR\")","v":"INCOMPLETO RECHAZAR"},224]
[{"$f":"+SOCIOS!G37","v":"c SOCIO PJ"},{"$f":"+SOCIOS!H37","v":0},{"$f":"+SOCIOS!H37","v":0},{"$f":"+SOCIOS!I37","v":"FECHA DE INSCRIPCION:"},{"$f":"IF(SOCIOS!J37>0,SOCIOS!J37,\"INCOMPLETO RECHAZAR\")","v":"INCOMPLETO RECHAZAR"},225]
[{"$f":"+SOCIOS!G49","v":"c SOCIO PJ"},{"$f":"+SOCIOS!H49","v":0},{"$f":"+SOCIOS!H49","v":0},{"$f":"+SOCIOS!I49","v":"NOTA/OBSERVACIÓN -en mayúscula-:"},{"$f":"IF(SOCIOS!J49>0,SOCIOS!J49,\"INCOMPLETO RECHAZAR\")","v":"INCOMPLETO RECHAZAR"},226]
[{"$f":"+SOCIOS!G42","v":"c SOCIO PJ"},{"$f":"+SOCIOS!H42","v":0},{"$f":"+SOCIOS!H42","v":0},{"$f":"+SOCIOS!I42","v":"OBJETO PRINCIPAL (EN FORMA RESUMIDA):"},{"$f":"IF(SOCIOS!J42>0,SOCIOS!J42,\"INCOMPLETO RECHAZAR\")","v":"INCOMPLETO RECHAZAR"},227]
[{"$f":"+SOCIOS!G35","v":"c SOCIO PJ"},{"$f":"+SOCIOS!H35","v":0},{"$f":"+SOCIOS!H35","v":0},{"$f":"+SOCIOS!I35","v":"ORGANISMO /s DONDE SE INSCRIBIÓ CONSTITUCIÓN (INDICAR LOCALIDAD/PCIA DEL ORG) -si no se inscribió poner: NO INSCRIPTO/A:"},{"$f":"IF(SOCIOS!J35>0,SOCIOS!J35,\"INCOMPLETO RECHAZAR\")","v":"INCOMPLETO RECHAZAR"},228]
[{"$f":"+SOCIOS!G40","v":"c SOCIO PJ"},{"$f":"+SOCIOS!H40","v":0},{"$f":"+SOCIOS!H40","v":0},{"$f":"+SOCIOS!I40","v":"SEDE SOCIAL:"},{"$f":"IF(SOCIOS!J40>0,SOCIOS!J40,\"INCOMPLETO RECHAZAR\")","v":"INCOMPLETO RECHAZAR"},229]
[{"$f":"+SOCIOS!G34","v":"c SOCIO PJ"},{"$f":"+SOCIOS!H34","v":0},{"$f":"+SOCIOS!H34","v":0},{"$f":"+SOCIOS!I34","v":"TIPO DE PERSONA JCA -sociedad, asociación, mutual, etc-:"},{"$f":"IF(SOCIOS!J34>0,SOCIOS!J34,\"INCOMPLETO RECHAZAR\")","v":"INCOMPLETO RECHAZAR"},230]
[{"$f":"+SOCIOS!G55","v":"c SOCIO PJ"},{"$f":"+SOCIOS!H55","v":0},{"$f":"+SOCIOS!H55","v":0},{"$f":"+SOCIOS!I55","v":"APELLIDO/S, NOMBRE/S,  DNI Y CARGO DE CADA MIEMBRO DE SU ADMINISTRACIÓN:"},{"$f":"IF(SOCIOS!J55>0,SOCIOS!J55,\"INCOMPLETO RECHAZAR\")","v":"INCOMPLETO RECHAZAR"},231]
[{"$f":"+SOCIOS!G58","v":"c SOCIO PJ"},{"$f":"+SOCIOS!H58","v":0},{"$f":"+SOCIOS!H58","v":0},{"$f":"+SOCIOS!I58","v":"CEL/TEL :"},{"$f":"IF(SOCIOS!J58>0,SOCIOS!J58,\"INCOMPLETO RECHAZAR\")","v":"INCOMPLETO RECHAZAR"},232]
[{"$f":"+SOCIOS!G50","v":"c SOCIO PJ"},{"$f":"+SOCIOS!H50","v":0},{"$f":"+SOCIOS!H50","v":0},{"$f":"+SOCIOS!I50","v":"CUIT –sin puntos ni barras-:"},{"$f":"IF(SOCIOS!J50>0,SOCIOS!J50,\"INCOMPLETO RECHAZAR\")","v":"INCOMPLETO RECHAZAR"},233]
[{"$f":"+SOCIOS!G53","v":"c SOCIO PJ"},{"$f":"+SOCIOS!H53","v":0},{"$f":"+SOCIOS!H53","v":0},{"$f":"+SOCIOS!I53","v":"DATOS DE RESOLUCIÓN Y FECHA DE INSCRIPCIÓN:"},{"$f":"IF(SOCIOS!J53>0,SOCIOS!J53,\"INCOMPLETO RECHAZAR\")","v":"INCOMPLETO RECHAZAR"},234]
[{"$f":"+SOCIOS!G56","v":"c SOCIO PJ"},{"$f":"+SOCIOS!H56","v":0},{"$f":"+SOCIOS!H56","v":0},{"$f":"+SOCIOS!I56","v":"DOMICILIO SOCIAL:"},{"$f":"IF(SOCIOS!J56>0,SOCIOS!J56,\"INCOMPLETO RECHAZAR\")","v":"INCOMPLETO RECHAZAR"},235]
[{"$f":"+SOCIOS!G54","v":"c SOCIO PJ"},{"$f":"+SOCIOS!H54","v":0},{"$f":"+SOCIOS!H54","v":0},{"$f":"+SOCIOS!I54","v":"FECHA DE INSCRIPCION:"},{"$f":"IF(SOCIOS!J54>0,SOCIOS!J54,\"INCOMPLETO RECHAZAR\")","v":"INCOMPLETO RECHAZAR"},236]
[{"$f":"+SOCIOS!G66","v":"c SOCIO PJ"},{"$f":"+SOCIOS!H66","v":0},{"$f":"+SOCIOS!H66","v":0},{"$f":"+SOCIOS!I66","v":"NOTA/OBSERVACIÓN -en mayúscula-:"},{"$f":"IF(SOCIOS!J66>0,SOCIOS!J66,\"INCOMPLETO RECHAZAR\")","v":"INCOMPLETO RECHAZAR"},237]
[{"$f":"+SOCIOS!G59","v":"c SOCIO PJ"},{"$f":"+SOCIOS!H59","v":0},{"$f":"+SOCIOS!H59","v":0},{"$f":"+SOCIOS!I59","v":"OBJETO PRINCIPAL (EN FORMA RESUMIDA):"},{"$f":"IF(SOCIOS!J59>0,SOCIOS!J59,\"INCOMPLETO RECHAZAR\")","v":"INCOMPLETO RECHAZAR"},238]
[{"$f":"+SOCIOS!G52","v":"c SOCIO PJ"},{"$f":"+SOCIOS!H52","v":0},{"$f":"+SOCIOS!H52","v":0},{"$f":"+SOCIOS!I52","v":"ORGANISMO /s DONDE SE INSCRIBIÓ CONSTITUCIÓN (INDICAR LOCALIDAD/PCIA DEL ORG) -si no se inscribió poner: NO INSCRIPTO/A:"},{"$f":"IF(SOCIOS!J52>0,SOCIOS!J52,\"INCOMPLETO RECHAZAR\")","v":"INCOMPLETO RECHAZAR"},239]
[{"$f":"+SOCIOS!G57","v":"c SOCIO PJ"},{"$f":"+SOCIOS!H57","v":0},{"$f":"+SOCIOS!H57","v":0},{"$f":"+SOCIOS!I57","v":"SEDE SOCIAL:"},{"$f":"IF(SOCIOS!J57>0,SOCIOS!J57,\"INCOMPLETO RECHAZAR\")","v":"INCOMPLETO RECHAZAR"},240]
[{"$f":"+SOCIOS!G51","v":"c SOCIO PJ"},{"$f":"+SOCIOS!H51","v":0},{"$f":"+SOCIOS!H51","v":0},{"$f":"+SOCIOS!I51","v":"TIPO DE PERSONA JCA -sociedad, asociación, mutual, etc-:"},{"$f":"IF(SOCIOS!J51>0,SOCIOS!J51,\"INCOMPLETO RECHAZAR\")","v":"INCOMPLETO RECHAZAR"},241]
[{"$f":"+SOCIOS!G72","v":"c SOCIO PJ"},{"$f":"+SOCIOS!H72","v":0},{"$f":"+SOCIOS!H72","v":0},{"$f":"+SOCIOS!I72","v":"APELLIDO/S, NOMBRE/S,  DNI Y CARGO DE CADA MIEMBRO DE SU ADMINISTRACIÓN:"},{"$f":"IF(SOCIOS!J72>0,SOCIOS!J72,\"INCOMPLETO RECHAZAR\")","v":"INCOMPLETO RECHAZAR"},242]
[{"$f":"+SOCIOS!G75","v":"c SOCIO PJ"},{"$f":"+SOCIOS!H75","v":0},{"$f":"+SOCIOS!H75","v":0},{"$f":"+SOCIOS!I75","v":"CEL/TEL :"},{"$f":"IF(SOCIOS!J75>0,SOCIOS!J75,\"INCOMPLETO RECHAZAR\")","v":"INCOMPLETO RECHAZAR"},243]
[{"$f":"+SOCIOS!G67","v":"c SOCIO PJ"},{"$f":"+SOCIOS!H67","v":0},{"$f":"+SOCIOS!H67","v":0},{"$f":"+SOCIOS!I67","v":"CUIT –sin puntos ni barras-:"},{"$f":"IF(SOCIOS!J67>0,SOCIOS!J67,\"INCOMPLETO RECHAZAR\")","v":"INCOMPLETO RECHAZAR"},244]
[{"$f":"+SOCIOS!G70","v":"c SOCIO PJ"},{"$f":"+SOCIOS!H70","v":0},{"$f":"+SOCIOS!H70","v":0},{"$f":"+SOCIOS!I70","v":"DATOS DE RESOLUCIÓN Y FECHA DE INSCRIPCIÓN:"},{"$f":"IF(SOCIOS!J70>0,SOCIOS!J70,\"INCOMPLETO RECHAZAR\")","v":"INCOMPLETO RECHAZAR"},245]
[{"$f":"+SOCIOS!G73","v":"c SOCIO PJ"},{"$f":"+SOCIOS!H73","v":0},{"$f":"+SOCIOS!H73","v":0},{"$f":"+SOCIOS!I73","v":"DOMICILIO SOCIAL:"},{"$f":"IF(SOCIOS!J73>0,SOCIOS!J73,\"INCOMPLETO RECHAZAR\")","v":"INCOMPLETO RECHAZAR"},246]
[{"$f":"+SOCIOS!G71","v":"c SOCIO PJ"},{"$f":"+SOCIOS!H71","v":0},{"$f":"+SOCIOS!H71","v":0},{"$f":"+SOCIOS!I71","v":"FECHA DE INSCRIPCION:"},{"$f":"IF(SOCIOS!J71>0,SOCIOS!J71,\"INCOMPLETO RECHAZAR\")","v":"INCOMPLETO RECHAZAR"},247]
[{"$f":"+SOCIOS!G83","v":"c SOCIO PJ"},{"$f":"+SOCIOS!H83","v":0},{"$f":"+SOCIOS!H83","v":0},{"$f":"+SOCIOS!I83","v":"NOTA/OBSERVACIÓN -en mayúscula-:"},{"$f":"IF(SOCIOS!J83>0,SOCIOS!J83,\"INCOMPLETO RECHAZAR\")","v":"INCOMPLETO RECHAZAR"},248]
[{"$f":"+SOCIOS!G76","v":"c SOCIO PJ"},{"$f":"+SOCIOS!H76","v":0},{"$f":"+SOCIOS!H76","v":0},{"$f":"+SOCIOS!I76","v":"OBJETO PRINCIPAL (EN FORMA RESUMIDA):"},{"$f":"IF(SOCIOS!J76>0,SOCIOS!J76,\"INCOMPLETO RECHAZAR\")","v":"INCOMPLETO RECHAZAR"},249]
[{"$f":"+SOCIOS!G69","v":"c SOCIO PJ"},{"$f":"+SOCIOS!H69","v":0},{"$f":"+SOCIOS!H69","v":0},{"$f":"+SOCIOS!I69","v":"ORGANISMO /s DONDE SE INSCRIBIÓ CONSTITUCIÓN (INDICAR LOCALIDAD/PCIA DEL ORG) -si no se inscribió poner: NO INSCRIPTO/A:"},{"$f":"IF(SOCIOS!J69>0,SOCIOS!J69,\"INCOMPLETO RECHAZAR\")","v":"INCOMPLETO RECHAZAR"},250]
[{"$f":"+SOCIOS!G74","v":"c SOCIO PJ"},{"$f":"+SOCIOS!H74","v":0},{"$f":"+SOCIOS!H74","v":0},{"$f":"+SOCIOS!I74","v":"SEDE SOCIAL:"},{"$f":"IF(SOCIOS!J74>0,SOCIOS!J74,\"INCOMPLETO RECHAZAR\")","v":"INCOMPLETO RECHAZAR"},251]
[{"$f":"+SOCIOS!G68","v":"c SOCIO PJ"},{"$f":"+SOCIOS!H68","v":0},{"$f":"+SOCIOS!H68","v":0},{"$f":"+SOCIOS!I68","v":"TIPO DE PERSONA JCA -sociedad, asociación, mutual, etc-:"},{"$f":"IF(SOCIOS!J68>0,SOCIOS!J68,\"INCOMPLETO RECHAZAR\")","v":"INCOMPLETO RECHAZAR"},252]
[{"$f":"+SOCIOS!G89","v":"c SOCIO PJ"},{"$f":"+SOCIOS!H89","v":0},{"$f":"+SOCIOS!H89","v":0},{"$f":"+SOCIOS!I89","v":"APELLIDO/S, NOMBRE/S,  DNI Y CARGO DE CADA MIEMBRO DE SU ADMINISTRACIÓN:"},{"$f":"IF(SOCIOS!J89>0,SOCIOS!J89,\"INCOMPLETO RECHAZAR\")","v":"INCOMPLETO RECHAZAR"},253]
[{"$f":"+SOCIOS!G92","v":"c SOCIO PJ"},{"$f":"+SOCIOS!H92","v":0},{"$f":"+SOCIOS!H92","v":0},{"$f":"+SOCIOS!I92","v":"CEL/TEL :"},{"$f":"IF(SOCIOS!J92>0,SOCIOS!J92,\"INCOMPLETO RECHAZAR\")","v":"INCOMPLETO RECHAZAR"},254]
[{"$f":"+SOCIOS!G84","v":"c SOCIO PJ"},{"$f":"+SOCIOS!H84","v":0},{"$f":"+SOCIOS!H84","v":0},{"$f":"+SOCIOS!I84","v":"CUIT –sin puntos ni barras-:"},{"$f":"IF(SOCIOS!J84>0,SOCIOS!J84,\"INCOMPLETO RECHAZAR\")","v":"INCOMPLETO RECHAZAR"},255]
[{"$f":"+SOCIOS!G87","v":"c SOCIO PJ"},{"$f":"+SOCIOS!H87","v":0},{"$f":"+SOCIOS!H87","v":0},{"$f":"+SOCIOS!I87","v":"DATOS DE RESOLUCIÓN Y FECHA DE INSCRIPCIÓN:"},{"$f":"IF(SOCIOS!J87>0,SOCIOS!J87,\"INCOMPLETO RECHAZAR\")","v":"INCOMPLETO RECHAZAR"},256]
[{"$f":"+SOCIOS!G90","v":"c SOCIO PJ"},{"$f":"+SOCIOS!H90","v":0},{"$f":"+SOCIOS!H90","v":0},{"$f":"+SOCIOS!I90","v":"DOMICILIO SOCIAL:"},{"$f":"IF(SOCIOS!J90>0,SOCIOS!J90,\"INCOMPLETO RECHAZAR\")","v":"INCOMPLETO RECHAZAR"},257]
[{"$f":"+SOCIOS!G88","v":"c SOCIO PJ"},{"$f":"+SOCIOS!H88","v":0},{"$f":"+SOCIOS!H88","v":0},{"$f":"+SOCIOS!I88","v":"FECHA DE INSCRIPCION:"},{"$f":"IF(SOCIOS!J88>0,SOCIOS!J88,\"INCOMPLETO RECHAZAR\")","v":"INCOMPLETO RECHAZAR"},258]
[{"$f":"+SOCIOS!G100","v":"c SOCIO PJ"},{"$f":"+SOCIOS!H100","v":0},{"$f":"+SOCIOS!H100","v":0},{"$f":"+SOCIOS!I100","v":"NOTA/OBSERVACIÓN -en mayúscula-:"},{"$f":"IF(SOCIOS!J100>0,SOCIOS!J100,\"INCOMPLETO RECHAZAR\")","v":"INCOMPLETO RECHAZAR"},259]
[{"$f":"+SOCIOS!G93","v":"c SOCIO PJ"},{"$f":"+SOCIOS!H93","v":0},{"$f":"+SOCIOS!H93","v":0},{"$f":"+SOCIOS!I93","v":"OBJETO PRINCIPAL (EN FORMA RESUMIDA):"},{"$f":"IF(SOCIOS!J93>0,SOCIOS!J93,\"INCOMPLETO RECHAZAR\")","v":"INCOMPLETO RECHAZAR"},260]
[{"$f":"+SOCIOS!G86","v":"c SOCIO PJ"},{"$f":"+SOCIOS!H86","v":0},{"$f":"+SOCIOS!H86","v":0},{"$f":"+SOCIOS!I86","v":"ORGANISMO /s DONDE SE INSCRIBIÓ CONSTITUCIÓN (INDICAR LOCALIDAD/PCIA DEL ORG) -si no se inscribió poner: NO INSCRIPTO/A:"},{"$f":"IF(SOCIOS!J86>0,SOCIOS!J86,\"INCOMPLETO RECHAZAR\")","v":"INCOMPLETO RECHAZAR"},261]
[{"$f":"+SOCIOS!G91","v":"c SOCIO PJ"},{"$f":"+SOCIOS!H91","v":0},{"$f":"+SOCIOS!H91","v":0},{"$f":"+SOCIOS!I91","v":"SEDE SOCIAL:"},{"$f":"IF(SOCIOS!J91>0,SOCIOS!J91,\"INCOMPLETO RECHAZAR\")","v":"INCOMPLETO RECHAZAR"},262]
[{"$f":"+SOCIOS!G85","v":"c SOCIO PJ"},{"$f":"+SOCIOS!H85","v":0},{"$f":"+SOCIOS!H85","v":0},{"$f":"+SOCIOS!I85","v":"TIPO DE PERSONA JCA -sociedad, asociación, mutual, etc-:"},{"$f":"IF(SOCIOS!J85>0,SOCIOS!J85,\"INCOMPLETO RECHAZAR\")","v":"INCOMPLETO RECHAZAR"},263]
[{"$f":"+SOCIOS!G106","v":"c SOCIO PJ"},{"$f":"+SOCIOS!H106","v":0},{"$f":"+SOCIOS!H106","v":0},{"$f":"+SOCIOS!I106","v":"APELLIDO/S, NOMBRE/S,  DNI Y CARGO DE CADA MIEMBRO DE SU ADMINISTRACIÓN:"},{"$f":"IF(SOCIOS!J106>0,SOCIOS!J106,\"INCOMPLETO RECHAZAR\")","v":"INCOMPLETO RECHAZAR"},264]
[{"$f":"+SOCIOS!G109","v":"c SOCIO PJ"},{"$f":"+SOCIOS!H109","v":0},{"$f":"+SOCIOS!H109","v":0},{"$f":"+SOCIOS!I109","v":"CEL/TEL :"},{"$f":"IF(SOCIOS!J109>0,SOCIOS!J109,\"INCOMPLETO RECHAZAR\")","v":"INCOMPLETO RECHAZAR"},265]
[{"$f":"+SOCIOS!G101","v":"c SOCIO PJ"},{"$f":"+SOCIOS!H101","v":0},{"$f":"+SOCIOS!H101","v":0},{"$f":"+SOCIOS!I101","v":"CUIT –sin puntos ni barras-:"},{"$f":"IF(SOCIOS!J101>0,SOCIOS!J101,\"INCOMPLETO RECHAZAR\")","v":"INCOMPLETO RECHAZAR"},266]
[{"$f":"+SOCIOS!G104","v":"c SOCIO PJ"},{"$f":"+SOCIOS!H104","v":0},{"$f":"+SOCIOS!H104","v":0},{"$f":"+SOCIOS!I104","v":"DATOS DE RESOLUCIÓN Y FECHA DE INSCRIPCIÓN:"},{"$f":"IF(SOCIOS!J104>0,SOCIOS!J104,\"INCOMPLETO RECHAZAR\")","v":"INCOMPLETO RECHAZAR"},267]
[{"$f":"+SOCIOS!G107","v":"c SOCIO PJ"},{"$f":"+SOCIOS!H107","v":0},{"$f":"+SOCIOS!H107","v":0},{"$f":"+SOCIOS!I107","v":"DOMICILIO SOCIAL:"},{"$f":"IF(SOCIOS!J107>0,SOCIOS!J107,\"INCOMPLETO RECHAZAR\")","v":"INCOMPLETO RECHAZAR"},268]
[{"$f":"+SOCIOS!G105","v":"c SOCIO PJ"},{"$f":"+SOCIOS!H105","v":0},{"$f":"+SOCIOS!H105","v":0},{"$f":"+SOCIOS!I105","v":"FECHA DE INSCRIPCION:"},{"$f":"IF(SOCIOS!J105>0,SOCIOS!J105,\"INCOMPLETO RECHAZAR\")","v":"INCOMPLETO RECHAZAR"},269]
[{"$f":"+SOCIOS!G117","v":"c SOCIO PJ"},{"$f":"+SOCIOS!H117","v":0},{"$f":"+SOCIOS!H117","v":0},{"$f":"+SOCIOS!I117","v":"NOTA/OBSERVACIÓN -en mayúscula-:"},{"$f":"IF(SOCIOS!J117>0,SOCIOS!J117,\"INCOMPLETO RECHAZAR\")","v":"INCOMPLETO RECHAZAR"},270]
[{"$f":"+SOCIOS!G110","v":"c SOCIO PJ"},{"$f":"+SOCIOS!H110","v":0},{"$f":"+SOCIOS!H110","v":0},{"$f":"+SOCIOS!I110","v":"OBJETO PRINCIPAL (EN FORMA RESUMIDA):"},{"$f":"IF(SOCIOS!J110>0,SOCIOS!J110,\"INCOMPLETO RECHAZAR\")","v":"INCOMPLETO RECHAZAR"},271]
[{"$f":"+SOCIOS!G103","v":"c SOCIO PJ"},{"$f":"+SOCIOS!H103","v":0},{"$f":"+SOCIOS!H103","v":0},{"$f":"+SOCIOS!I103","v":"ORGANISMO /s DONDE SE INSCRIBIÓ CONSTITUCIÓN (INDICAR LOCALIDAD/PCIA DEL ORG) -si no se inscribió poner: NO INSCRIPTO/A:"},{"$f":"IF(SOCIOS!J103>0,SOCIOS!J103,\"INCOMPLETO RECHAZAR\")","v":"INCOMPLETO RECHAZAR"},272]
[{"$f":"+SOCIOS!G108","v":"c SOCIO PJ"},{"$f":"+SOCIOS!H108","v":0},{"$f":"+SOCIOS!H108","v":0},{"$f":"+SOCIOS!I108","v":"SEDE SOCIAL:"},{"$f":"IF(SOCIOS!J108>0,SOCIOS!J108,\"INCOMPLETO RECHAZAR\")","v":"INCOMPLETO RECHAZAR"},273]
[{"$f":"+SOCIOS!G102","v":"c SOCIO PJ"},{"$f":"+SOCIOS!H102","v":0},{"$f":"+SOCIOS!H102","v":0},{"$f":"+SOCIOS!I102","v":"TIPO DE PERSONA JCA -sociedad, asociación, mutual, etc-:"},{"$f":"IF(SOCIOS!J102>0,SOCIOS!J102,\"INCOMPLETO RECHAZAR\")","v":"INCOMPLETO RECHAZAR"},274]
[{"$f":"+SOCIOS!G123","v":"c SOCIO PJ"},{"$f":"+SOCIOS!H123","v":0},{"$f":"+SOCIOS!H123","v":0},{"$f":"+SOCIOS!I123","v":"APELLIDO/S, NOMBRE/S,  DNI Y CARGO DE CADA MIEMBRO DE SU ADMINISTRACIÓN:"},{"$f":"IF(SOCIOS!J123>0,SOCIOS!J123,\"INCOMPLETO RECHAZAR\")","v":"INCOMPLETO RECHAZAR"},275]
[{"$f":"+SOCIOS!G126","v":"c SOCIO PJ"},{"$f":"+SOCIOS!H126","v":0},{"$f":"+SOCIOS!H126","v":0},{"$f":"+SOCIOS!I126","v":"CEL/TEL :"},{"$f":"IF(SOCIOS!J126>0,SOCIOS!J126,\"INCOMPLETO RECHAZAR\")","v":"INCOMPLETO RECHAZAR"},276]
[{"$f":"+SOCIOS!G118","v":"c SOCIO PJ"},{"$f":"+SOCIOS!H118","v":0},{"$f":"+SOCIOS!H118","v":0},{"$f":"+SOCIOS!I118","v":"CUIT –sin puntos ni barras-:"},{"$f":"IF(SOCIOS!J118>0,SOCIOS!J118,\"INCOMPLETO RECHAZAR\")","v":"INCOMPLETO RECHAZAR"},277]
[{"$f":"+SOCIOS!G121","v":"c SOCIO PJ"},{"$f":"+SOCIOS!H121","v":0},{"$f":"+SOCIOS!H121","v":0},{"$f":"+SOCIOS!I121","v":"DATOS DE RESOLUCIÓN Y FECHA DE INSCRIPCIÓN:"},{"$f":"IF(SOCIOS!J121>0,SOCIOS!J121,\"INCOMPLETO RECHAZAR\")","v":"INCOMPLETO RECHAZAR"},278]
[{"$f":"+SOCIOS!G124","v":"c SOCIO PJ"},{"$f":"+SOCIOS!H124","v":0},{"$f":"+SOCIOS!H124","v":0},{"$f":"+SOCIOS!I124","v":"DOMICILIO SOCIAL:"},{"$f":"IF(SOCIOS!J124>0,SOCIOS!J124,\"INCOMPLETO RECHAZAR\")","v":"INCOMPLETO RECHAZAR"},279]
[{"$f":"+SOCIOS!G122","v":"c SOCIO PJ"},{"$f":"+SOCIOS!H122","v":0},{"$f":"+SOCIOS!H122","v":0},{"$f":"+SOCIOS!I122","v":"FECHA DE INSCRIPCION:"},{"$f":"IF(SOCIOS!J122>0,SOCIOS!J122,\"INCOMPLETO RECHAZAR\")","v":"INCOMPLETO RECHAZAR"},280]
[{"$f":"+SOCIOS!G134","v":"c SOCIO PJ"},{"$f":"+SOCIOS!H134","v":0},{"$f":"+SOCIOS!H134","v":0},{"$f":"+SOCIOS!I134","v":"NOTA/OBSERVACIÓN -en mayúscula-:"},{"$f":"IF(SOCIOS!J134>0,SOCIOS!J134,\"INCOMPLETO RECHAZAR\")","v":"INCOMPLETO RECHAZAR"},281]
[{"$f":"+SOCIOS!G127","v":"c SOCIO PJ"},{"$f":"+SOCIOS!H127","v":0},{"$f":"+SOCIOS!H127","v":0},{"$f":"+SOCIOS!I127","v":"OBJETO PRINCIPAL (EN FORMA RESUMIDA):"},{"$f":"IF(SOCIOS!J127>0,SOCIOS!J127,\"INCOMPLETO RECHAZAR\")","v":"INCOMPLETO RECHAZAR"},282]
[{"$f":"+SOCIOS!G120","v":"c SOCIO PJ"},{"$f":"+SOCIOS!H120","v":0},{"$f":"+SOCIOS!H120","v":0},{"$f":"+SOCIOS!I120","v":"ORGANISMO /s DONDE SE INSCRIBIÓ CONSTITUCIÓN (INDICAR LOCALIDAD/PCIA DEL ORG) -si no se inscribió poner: NO INSCRIPTO/A:"},{"$f":"IF(SOCIOS!J120>0,SOCIOS!J120,\"INCOMPLETO RECHAZAR\")","v":"INCOMPLETO RECHAZAR"},283]
[{"$f":"+SOCIOS!G125","v":"c SOCIO PJ"},{"$f":"+SOCIOS!H125","v":0},{"$f":"+SOCIOS!H125","v":0},{"$f":"+SOCIOS!I125","v":"SEDE SOCIAL:"},{"$f":"IF(SOCIOS!J125>0,SOCIOS!J125,\"INCOMPLETO RECHAZAR\")","v":"INCOMPLETO RECHAZAR"},284]
[{"$f":"+SOCIOS!G119","v":"c SOCIO PJ"},{"$f":"+SOCIOS!H119","v":0},{"$f":"+SOCIOS!H119","v":0},{"$f":"+SOCIOS!I119","v":"TIPO DE PERSONA JCA -sociedad, asociación, mutual, etc-:"},{"$f":"IF(SOCIOS!J119>0,SOCIOS!J119,\"INCOMPLETO RECHAZAR\")","v":"INCOMPLETO RECHAZAR"},285]
[{"$f":"+SOCIOS!G140","v":"c SOCIO PJ"},{"$f":"+SOCIOS!H140","v":0},{"$f":"+SOCIOS!H140","v":0},{"$f":"+SOCIOS!I140","v":"APELLIDO/S, NOMBRE/S,  DNI Y CARGO DE CADA MIEMBRO DE SU ADMINISTRACIÓN:"},{"$f":"IF(SOCIOS!J140>0,SOCIOS!J140,\"INCOMPLETO RECHAZAR\")","v":"INCOMPLETO RECHAZAR"},286]
[{"$f":"+SOCIOS!G143","v":"c SOCIO PJ"},{"$f":"+SOCIOS!H143","v":0},{"$f":"+SOCIOS!H143","v":0},{"$f":"+SOCIOS!I143","v":"CEL/TEL :"},{"$f":"IF(SOCIOS!J143>0,SOCIOS!J143,\"INCOMPLETO RECHAZAR\")","v":"INCOMPLETO RECHAZAR"},287]
[{"$f":"+SOCIOS!G135","v":"c SOCIO PJ"},{"$f":"+SOCIOS!H135","v":0},{"$f":"+SOCIOS!H135","v":0},{"$f":"+SOCIOS!I135","v":"CUIT –sin puntos ni barras-:"},{"$f":"IF(SOCIOS!J135>0,SOCIOS!J135,\"INCOMPLETO RECHAZAR\")","v":"INCOMPLETO RECHAZAR"},288]
[{"$f":"+SOCIOS!G138","v":"c SOCIO PJ"},{"$f":"+SOCIOS!H138","v":0},{"$f":"+SOCIOS!H138","v":0},{"$f":"+SOCIOS!I138","v":"DATOS DE RESOLUCIÓN Y FECHA DE INSCRIPCIÓN:"},{"$f":"IF(SOCIOS!J138>0,SOCIOS!J138,\"INCOMPLETO RECHAZAR\")","v":"INCOMPLETO RECHAZAR"},289]
[{"$f":"+SOCIOS!G141","v":"c SOCIO PJ"},{"$f":"+SOCIOS!H141","v":0},{"$f":"+SOCIOS!H141","v":0},{"$f":"+SOCIOS!I141","v":"DOMICILIO SOCIAL:"},{"$f":"IF(SOCIOS!J141>0,SOCIOS!J141,\"INCOMPLETO RECHAZAR\")","v":"INCOMPLETO RECHAZAR"},290]
[{"$f":"+SOCIOS!G139","v":"c SOCIO PJ"},{"$f":"+SOCIOS!H139","v":0},{"$f":"+SOCIOS!H139","v":0},{"$f":"+SOCIOS!I139","v":"FECHA DE INSCRIPCION:"},{"$f":"IF(SOCIOS!J139>0,SOCIOS!J139,\"INCOMPLETO RECHAZAR\")","v":"INCOMPLETO RECHAZAR"},291]
[{"$f":"+SOCIOS!G151","v":"c SOCIO PJ"},{"$f":"+SOCIOS!H151","v":0},{"$f":"+SOCIOS!H151","v":0},{"$f":"+SOCIOS!I151","v":"NOTA/OBSERVACIÓN -en mayúscula-:"},{"$f":"IF(SOCIOS!J151>0,SOCIOS!J151,\"INCOMPLETO RECHAZAR\")","v":"INCOMPLETO RECHAZAR"},292]
[{"$f":"+SOCIOS!G144","v":"c SOCIO PJ"},{"$f":"+SOCIOS!H144","v":0},{"$f":"+SOCIOS!H144","v":0},{"$f":"+SOCIOS!I144","v":"OBJETO PRINCIPAL (EN FORMA RESUMIDA):"},{"$f":"IF(SOCIOS!J144>0,SOCIOS!J144,\"INCOMPLETO RECHAZAR\")","v":"INCOMPLETO RECHAZAR"},293]
[{"$f":"+SOCIOS!G137","v":"c SOCIO PJ"},{"$f":"+SOCIOS!H137","v":0},{"$f":"+SOCIOS!H137","v":0},{"$f":"+SOCIOS!I137","v":"ORGANISMO /s DONDE SE INSCRIBIÓ CONSTITUCIÓN (INDICAR LOCALIDAD/PCIA DEL ORG) -si no se inscribió poner: NO INSCRIPTO/A:"},{"$f":"IF(SOCIOS!J137>0,SOCIOS!J137,\"INCOMPLETO RECHAZAR\")","v":"INCOMPLETO RECHAZAR"},294]
[{"$f":"+SOCIOS!G142","v":"c SOCIO PJ"},{"$f":"+SOCIOS!H142","v":0},{"$f":"+SOCIOS!H142","v":0},{"$f":"+SOCIOS!I142","v":"SEDE SOCIAL:"},{"$f":"IF(SOCIOS!J142>0,SOCIOS!J142,\"INCOMPLETO RECHAZAR\")","v":"INCOMPLETO RECHAZAR"},295]
[{"$f":"+SOCIOS!G136","v":"c SOCIO PJ"},{"$f":"+SOCIOS!H136","v":0},{"$f":"+SOCIOS!H136","v":0},{"$f":"+SOCIOS!I136","v":"TIPO DE PERSONA JCA -sociedad, asociación, mutual, etc-:"},{"$f":"IF(SOCIOS!J136>0,SOCIOS!J136,\"INCOMPLETO RECHAZAR\")","v":"INCOMPLETO RECHAZAR"},296]
[{"$f":"+SOCIOS!G157","v":"c SOCIO PJ"},{"$f":"+SOCIOS!H157","v":0},{"$f":"+SOCIOS!H157","v":0},{"$f":"+SOCIOS!I157","v":"APELLIDO/S, NOMBRE/S,  DNI Y CARGO DE CADA MIEMBRO DE SU ADMINISTRACIÓN:"},{"$f":"IF(SOCIOS!J157>0,SOCIOS!J157,\"INCOMPLETO RECHAZAR\")","v":"INCOMPLETO RECHAZAR"},297]
[{"$f":"+SOCIOS!G160","v":"c SOCIO PJ"},{"$f":"+SOCIOS!H160","v":0},{"$f":"+SOCIOS!H160","v":0},{"$f":"+SOCIOS!I160","v":"CEL/TEL :"},{"$f":"IF(SOCIOS!J160>0,SOCIOS!J160,\"INCOMPLETO RECHAZAR\")","v":"INCOMPLETO RECHAZAR"},298]
[{"$f":"+SOCIOS!G152","v":"c SOCIO PJ"},{"$f":"+SOCIOS!H152","v":0},{"$f":"+SOCIOS!H152","v":0},{"$f":"+SOCIOS!I152","v":"CUIT –sin puntos ni barras-:"},{"$f":"IF(SOCIOS!J152>0,SOCIOS!J152,\"INCOMPLETO RECHAZAR\")","v":"INCOMPLETO RECHAZAR"},299]
[{"$f":"+SOCIOS!G155","v":"c SOCIO PJ"},{"$f":"+SOCIOS!H155","v":0},{"$f":"+SOCIOS!H155","v":0},{"$f":"+SOCIOS!I155","v":"DATOS DE RESOLUCIÓN Y FECHA DE INSCRIPCIÓN:"},{"$f":"IF(SOCIOS!J155>0,SOCIOS!J155,\"INCOMPLETO RECHAZAR\")","v":"INCOMPLETO RECHAZAR"},300]
[{"$f":"+SOCIOS!G158","v":"c SOCIO PJ"},{"$f":"+SOCIOS!H158","v":0},{"$f":"+SOCIOS!H158","v":0},{"$f":"+SOCIOS!I158","v":"DOMICILIO SOCIAL:"},{"$f":"IF(SOCIOS!J158>0,SOCIOS!J158,\"INCOMPLETO RECHAZAR\")","v":"INCOMPLETO RECHAZAR"},301]
[{"$f":"+SOCIOS!G156","v":"c SOCIO PJ"},{"$f":"+SOCIOS!H156","v":0},{"$f":"+SOCIOS!H156","v":0},{"$f":"+SOCIOS!I156","v":"FECHA DE INSCRIPCION:"},{"$f":"IF(SOCIOS!J156>0,SOCIOS!J156,\"INCOMPLETO RECHAZAR\")","v":"INCOMPLETO RECHAZAR"},302]
[{"$f":"+SOCIOS!G168","v":"c SOCIO PJ"},{"$f":"+SOCIOS!H168","v":0},{"$f":"+SOCIOS!H168","v":0},{"$f":"+SOCIOS!I168","v":"NOTA/OBSERVACIÓN -en mayúscula-:"},{"$f":"IF(SOCIOS!J168>0,SOCIOS!J168,\"INCOMPLETO RECHAZAR\")","v":"INCOMPLETO RECHAZAR"},303]
[{"$f":"+SOCIOS!G161","v":"c SOCIO PJ"},{"$f":"+SOCIOS!H161","v":0},{"$f":"+SOCIOS!H161","v":0},{"$f":"+SOCIOS!I161","v":"OBJETO PRINCIPAL (EN FORMA RESUMIDA):"},{"$f":"IF(SOCIOS!J161>0,SOCIOS!J161,\"INCOMPLETO RECHAZAR\")","v":"INCOMPLETO RECHAZAR"},304]
[{"$f":"+SOCIOS!G154","v":"c SOCIO PJ"},{"$f":"+SOCIOS!H154","v":0},{"$f":"+SOCIOS!H154","v":0},{"$f":"+SOCIOS!I154","v":"ORGANISMO /s DONDE SE INSCRIBIÓ CONSTITUCIÓN (INDICAR LOCALIDAD/PCIA DEL ORG) -si no se inscribió poner: NO INSCRIPTO/A:"},{"$f":"IF(SOCIOS!J154>0,SOCIOS!J154,\"INCOMPLETO RECHAZAR\")","v":"INCOMPLETO RECHAZAR"},305]
[{"$f":"+SOCIOS!G159","v":"c SOCIO PJ"},{"$f":"+SOCIOS!H159","v":0},{"$f":"+SOCIOS!H159","v":0},{"$f":"+SOCIOS!I159","v":"SEDE SOCIAL:"},{"$f":"IF(SOCIOS!J159>0,SOCIOS!J159,\"INCOMPLETO RECHAZAR\")","v":"INCOMPLETO RECHAZAR"},306]
[{"$f":"+SOCIOS!G153","v":"c SOCIO PJ"},{"$f":"+SOCIOS!H153","v":0},{"$f":"+SOCIOS!H153","v":0},{"$f":"+SOCIOS!I153","v":"TIPO DE PERSONA JCA -sociedad, asociación, mutual, etc-:"},{"$f":"IF(SOCIOS!J153>0,SOCIOS!J153,\"INCOMPLETO RECHAZAR\")","v":"INCOMPLETO RECHAZAR"},307]
[{"$f":"+SOCIOS!G174","v":"c SOCIO PJ"},{"$f":"+SOCIOS!H174","v":0},{"$f":"+SOCIOS!H174","v":0},{"$f":"+SOCIOS!I174","v":"APELLIDO/S, NOMBRE/S,  DNI Y CARGO DE CADA MIEMBRO DE SU ADMINISTRACIÓN:"},{"$f":"IF(SOCIOS!J174>0,SOCIOS!J174,\"INCOMPLETO RECHAZAR\")","v":"INCOMPLETO RECHAZAR"},308]
[{"$f":"+SOCIOS!G177","v":"c SOCIO PJ"},{"$f":"+SOCIOS!H177","v":0},{"$f":"+SOCIOS!H177","v":0},{"$f":"+SOCIOS!I177","v":"CEL/TEL :"},{"$f":"IF(SOCIOS!J177>0,SOCIOS!J177,\"INCOMPLETO RECHAZAR\")","v":"INCOMPLETO RECHAZAR"},309]
[{"$f":"+SOCIOS!G169","v":"c SOCIO PJ"},{"$f":"+SOCIOS!H169","v":0},{"$f":"+SOCIOS!H169","v":0},{"$f":"+SOCIOS!I169","v":"CUIT –sin puntos ni barras-:"},{"$f":"IF(SOCIOS!J169>0,SOCIOS!J169,\"INCOMPLETO RECHAZAR\")","v":"INCOMPLETO RECHAZAR"},310]
[{"$f":"+SOCIOS!G172","v":"c SOCIO PJ"},{"$f":"+SOCIOS!H172","v":0},{"$f":"+SOCIOS!H172","v":0},{"$f":"+SOCIOS!I172","v":"DATOS DE RESOLUCIÓN Y FECHA DE INSCRIPCIÓN:"},{"$f":"IF(SOCIOS!J172>0,SOCIOS!J172,\"INCOMPLETO RECHAZAR\")","v":"INCOMPLETO RECHAZAR"},311]
[{"$f":"+SOCIOS!G175","v":"c SOCIO PJ"},{"$f":"+SOCIOS!H175","v":0},{"$f":"+SOCIOS!H175","v":0},{"$f":"+SOCIOS!I175","v":"DOMICILIO SOCIAL:"},{"$f":"IF(SOCIOS!J175>0,SOCIOS!J175,\"INCOMPLETO RECHAZAR\")","v":"INCOMPLETO RECHAZAR"},312]
[{"$f":"+SOCIOS!G173","v":"c SOCIO PJ"},{"$f":"+SOCIOS!H173","v":0},{"$f":"+SOCIOS!H173","v":0},{"$f":"+SOCIOS!I173","v":"FECHA DE INSCRIPCION:"},{"$f":"IF(SOCIOS!J173>0,SOCIOS!J173,\"INCOMPLETO RECHAZAR\")","v":"INCOMPLETO RECHAZAR"},313]
[{"$f":"+SOCIOS!G185","v":"c SOCIO PJ"},{"$f":"+SOCIOS!H185","v":0},{"$f":"+SOCIOS!H185","v":0},{"$f":"+SOCIOS!I185","v":"NOTA/OBSERVACIÓN -en mayúscula-:"},{"$f":"IF(SOCIOS!J185>0,SOCIOS!J185,\"INCOMPLETO RECHAZAR\")","v":"INCOMPLETO RECHAZAR"},314]
[{"$f":"+SOCIOS!G178","v":"c SOCIO PJ"},{"$f":"+SOCIOS!H178","v":0},{"$f":"+SOCIOS!H178","v":0},{"$f":"+SOCIOS!I178","v":"OBJETO PRINCIPAL (EN FORMA RESUMIDA):"},{"$f":"IF(SOCIOS!J178>0,SOCIOS!J178,\"INCOMPLETO RECHAZAR\")","v":"INCOMPLETO RECHAZAR"},315]
[{"$f":"+SOCIOS!G171","v":"c SOCIO PJ"},{"$f":"+SOCIOS!H171","v":0},{"$f":"+SOCIOS!H171","v":0},{"$f":"+SOCIOS!I171","v":"ORGANISMO /s DONDE SE INSCRIBIÓ CONSTITUCIÓN (INDICAR LOCALIDAD/PCIA DEL ORG) -si no se inscribió poner: NO INSCRIPTO/A:"},{"$f":"IF(SOCIOS!J171>0,SOCIOS!J171,\"INCOMPLETO RECHAZAR\")","v":"INCOMPLETO RECHAZAR"},316]
[{"$f":"+SOCIOS!G176","v":"c SOCIO PJ"},{"$f":"+SOCIOS!H176","v":0},{"$f":"+SOCIOS!H176","v":0},{"$f":"+SOCIOS!I176","v":"SEDE SOCIAL:"},{"$f":"IF(SOCIOS!J176>0,SOCIOS!J176,\"INCOMPLETO RECHAZAR\")","v":"INCOMPLETO RECHAZAR"},317]
[{"$f":"+SOCIOS!G170","v":"c SOCIO PJ"},{"$f":"+SOCIOS!H170","v":0},{"$f":"+SOCIOS!H170","v":0},{"$f":"+SOCIOS!I170","v":"TIPO DE PERSONA JCA -sociedad, asociación, mutual, etc-:"},{"$f":"IF(SOCIOS!J170>0,SOCIOS!J170,\"INCOMPLETO RECHAZAR\")","v":"INCOMPLETO RECHAZAR"},318]
[{"$f":"+SOCIOS!A29","v":"d CANT. ACC."},{"$f":"+SOCIOS!B29","v":0},{"$f":"+SOCIOS!C29","v":0},{"$f":"+SOCIOS!D29","v":"NROS DE ACCIONES TITULAR:"},{"$f":"IF(SOCIOS!E29>0,SOCIOS!E29,\"INCOMPLETO RECHAZAR\")","v":"INCOMPLETO RECHAZAR"},319]
[{"$f":"+SOCIOS!A51","v":"d CANT. ACC."},{"$f":"+SOCIOS!B51","v":0},{"$f":"+SOCIOS!C51","v":0},{"$f":"+SOCIOS!D51","v":"NROS DE ACCIONES TITULAR:"},{"$f":"IF(SOCIOS!E51>0,SOCIOS!E51,\"INCOMPLETO RECHAZAR\")","v":"INCOMPLETO RECHAZAR"},320]
[{"$f":"+SOCIOS!A73","v":"d CANT. ACC."},{"$f":"+SOCIOS!B73","v":0},{"$f":"+SOCIOS!C73","v":0},{"$f":"+SOCIOS!D73","v":"NROS DE ACCIONES TITULAR:"},{"$f":"IF(SOCIOS!E73>0,SOCIOS!E73,\"INCOMPLETO RECHAZAR\")","v":"INCOMPLETO RECHAZAR"},321]
[{"$f":"+SOCIOS!A95","v":"d CANT. ACC."},{"$f":"+SOCIOS!B95","v":0},{"$f":"+SOCIOS!C95","v":0},{"$f":"+SOCIOS!D95","v":"NROS DE ACCIONES TITULAR:"},{"$f":"IF(SOCIOS!E95>0,SOCIOS!E95,\"INCOMPLETO RECHAZAR\")","v":"INCOMPLETO RECHAZAR"},322]
[{"$f":"+SOCIOS!A117","v":"d CANT. ACC."},{"$f":"+SOCIOS!B117","v":0},{"$f":"+SOCIOS!C117","v":0},{"$f":"+SOCIOS!D117","v":"NROS DE ACCIONES TITULAR:"},{"$f":"IF(SOCIOS!E117>0,SOCIOS!E117,\"INCOMPLETO RECHAZAR\")","v":"INCOMPLETO RECHAZAR"},323]
[{"$f":"+SOCIOS!A139","v":"d CANT. ACC."},{"$f":"+SOCIOS!B139","v":0},{"$f":"+SOCIOS!C139","v":0},{"$f":"+SOCIOS!D139","v":"NROS DE ACCIONES TITULAR:"},{"$f":"IF(SOCIOS!E139>0,SOCIOS!E139,\"INCOMPLETO RECHAZAR\")","v":"INCOMPLETO RECHAZAR"},324]
[{"$f":"+SOCIOS!A161","v":"d CANT. ACC."},{"$f":"+SOCIOS!B161","v":0},{"$f":"+SOCIOS!C161","v":0},{"$f":"+SOCIOS!D161","v":"NROS DE ACCIONES TITULAR:"},{"$f":"IF(SOCIOS!E161>0,SOCIOS!E161,\"INCOMPLETO RECHAZAR\")","v":"INCOMPLETO RECHAZAR"},325]
[{"$f":"+SOCIOS!A183","v":"d CANT. ACC."},{"$f":"+SOCIOS!B183","v":0},{"$f":"+SOCIOS!C183","v":0},{"$f":"+SOCIOS!D183","v":"NROS DE ACCIONES TITULAR:"},{"$f":"IF(SOCIOS!E183>0,SOCIOS!E183,\"INCOMPLETO RECHAZAR\")","v":"INCOMPLETO RECHAZAR"},326]
[{"$f":"+SOCIOS!A205","v":"d CANT. ACC."},{"$f":"+SOCIOS!B205","v":0},{"$f":"+SOCIOS!C205","v":0},{"$f":"+SOCIOS!D205","v":"NROS DE ACCIONES TITULAR:"},{"$f":"IF(SOCIOS!E205>0,SOCIOS!E205,\"INCOMPLETO RECHAZAR\")","v":"INCOMPLETO RECHAZAR"},327]
[{"$f":"+SOCIOS!A227","v":"d CANT. ACC."},{"$f":"+SOCIOS!B227","v":0},{"$f":"+SOCIOS!C227","v":0},{"$f":"+SOCIOS!D227","v":"NROS DE ACCIONES TITULAR:"},{"$f":"IF(SOCIOS!E227>0,SOCIOS!E227,\"INCOMPLETO RECHAZAR\")","v":"INCOMPLETO RECHAZAR"},328]
[{"$f":"+SOCIOS!A249","v":"d CANT. ACC."},{"$f":"+SOCIOS!B249","v":0},{"$f":"+SOCIOS!C249","v":0},{"$f":"+SOCIOS!D249","v":"NROS DE ACCIONES TITULAR:"},{"$f":"IF(SOCIOS!E249>0,SOCIOS!E249,\"INCOMPLETO RECHAZAR\")","v":"INCOMPLETO RECHAZAR"},329]
[{"$f":"+SOCIOS!A271","v":"d CANT. ACC."},{"$f":"+SOCIOS!B271","v":0},{"$f":"+SOCIOS!C271","v":0},{"$f":"+SOCIOS!D271","v":"NROS DE ACCIONES TITULAR:"},{"$f":"IF(SOCIOS!E271>0,SOCIOS!E271,\"INCOMPLETO RECHAZAR\")","v":"INCOMPLETO RECHAZAR"},330]
[{"$f":"+SOCIOS!A293","v":"d CANT. ACC."},{"$f":"+SOCIOS!B293","v":0},{"$f":"+SOCIOS!C293","v":0},{"$f":"+SOCIOS!D293","v":"NROS DE ACCIONES TITULAR:"},{"$f":"IF(SOCIOS!E293>0,SOCIOS!E293,\"INCOMPLETO RECHAZAR\")","v":"INCOMPLETO RECHAZAR"},331]
[{"$f":"+SOCIOS!A315","v":"d CANT. ACC."},{"$f":"+SOCIOS!B315","v":0},{"$f":"+SOCIOS!C315","v":0},{"$f":"+SOCIOS!D315","v":"NROS DE ACCIONES TITULAR:"},{"$f":"IF(SOCIOS!E315>0,SOCIOS!E315,\"INCOMPLETO RECHAZAR\")","v":"INCOMPLETO RECHAZAR"},332]
[{"$f":"+SOCIOS!G26","v":"d CANT. ACC."},{"$f":"+SOCIOS!H26","v":0},{"$f":"+SOCIOS!H26","v":0},{"$f":"+SOCIOS!I26","v":"NROS DE ACCIONES TITULAR:"},{"$f":"IF(SOCIOS!J26>0,SOCIOS!J26,\"INCOMPLETO RECHAZAR\")","v":"INCOMPLETO RECHAZAR"},333]
[{"$f":"+SOCIOS!G43","v":"d CANT. ACC."},{"$f":"+SOCIOS!H43","v":0},{"$f":"+SOCIOS!H43","v":0},{"$f":"+SOCIOS!I43","v":"NROS DE ACCIONES TITULAR:"},{"$f":"IF(SOCIOS!J43>0,SOCIOS!J43,\"INCOMPLETO RECHAZAR\")","v":"INCOMPLETO RECHAZAR"},334]
[{"$f":"+SOCIOS!G60","v":"d CANT. ACC."},{"$f":"+SOCIOS!H60","v":0},{"$f":"+SOCIOS!H60","v":0},{"$f":"+SOCIOS!I60","v":"NROS DE ACCIONES TITULAR:"},{"$f":"IF(SOCIOS!J60>0,SOCIOS!J60,\"INCOMPLETO RECHAZAR\")","v":"INCOMPLETO RECHAZAR"},335]
[{"$f":"+SOCIOS!G77","v":"d CANT. ACC."},{"$f":"+SOCIOS!H77","v":0},{"$f":"+SOCIOS!H77","v":0},{"$f":"+SOCIOS!I77","v":"NROS DE ACCIONES TITULAR:"},{"$f":"IF(SOCIOS!J77>0,SOCIOS!J77,\"INCOMPLETO RECHAZAR\")","v":"INCOMPLETO RECHAZAR"},336]
[{"$f":"+SOCIOS!G94","v":"d CANT. ACC."},{"$f":"+SOCIOS!H94","v":0},{"$f":"+SOCIOS!H94","v":0},{"$f":"+SOCIOS!I94","v":"NROS DE ACCIONES TITULAR:"},{"$f":"IF(SOCIOS!J94>0,SOCIOS!J94,\"INCOMPLETO RECHAZAR\")","v":"INCOMPLETO RECHAZAR"},337]
[{"$f":"+SOCIOS!G111","v":"d CANT. ACC."},{"$f":"+SOCIOS!H111","v":0},{"$f":"+SOCIOS!H111","v":0},{"$f":"+SOCIOS!I111","v":"NROS DE ACCIONES TITULAR:"},{"$f":"IF(SOCIOS!J111>0,SOCIOS!J111,\"INCOMPLETO RECHAZAR\")","v":"INCOMPLETO RECHAZAR"},338]
[{"$f":"+SOCIOS!G128","v":"d CANT. ACC."},{"$f":"+SOCIOS!H128","v":0},{"$f":"+SOCIOS!H128","v":0},{"$f":"+SOCIOS!I128","v":"NROS DE ACCIONES TITULAR:"},{"$f":"IF(SOCIOS!J128>0,SOCIOS!J128,\"INCOMPLETO RECHAZAR\")","v":"INCOMPLETO RECHAZAR"},339]
[{"$f":"+SOCIOS!G145","v":"d CANT. ACC."},{"$f":"+SOCIOS!H145","v":0},{"$f":"+SOCIOS!H145","v":0},{"$f":"+SOCIOS!I145","v":"NROS DE ACCIONES TITULAR:"},{"$f":"IF(SOCIOS!J145>0,SOCIOS!J145,\"INCOMPLETO RECHAZAR\")","v":"INCOMPLETO RECHAZAR"},340]
[{"$f":"+SOCIOS!G162","v":"d CANT. ACC."},{"$f":"+SOCIOS!H162","v":0},{"$f":"+SOCIOS!H162","v":0},{"$f":"+SOCIOS!I162","v":"NROS DE ACCIONES TITULAR:"},{"$f":"IF(SOCIOS!J162>0,SOCIOS!J162,\"INCOMPLETO RECHAZAR\")","v":"INCOMPLETO RECHAZAR"},341]
[{"$f":"+SOCIOS!G179","v":"d CANT. ACC."},{"$f":"+SOCIOS!H179","v":0},{"$f":"+SOCIOS!H179","v":0},{"$f":"+SOCIOS!I179","v":"NROS DE ACCIONES TITULAR:"},{"$f":"IF(SOCIOS!J179>0,SOCIOS!J179,\"INCOMPLETO RECHAZAR\")","v":"INCOMPLETO RECHAZAR"},342]
[{"$f":"+'SOLICITUD-DATOS SOC'!A34","v":"d CANT. ACC. TOT."},{"$f":"UPPER('SOLICITUD-DATOS SOC'!B34)","v":"0"},{"$f":"UPPER('SOLICITUD-DATOS SOC'!C34)","v":"0"},{"$f":"+'SOLICITUD-DATOS SOC'!D34","v":"TOTAL ACCIONES:"},{"$f":"IF('SOLICITUD-DATOS SOC'!E34>0,'SOLICITUD-DATOS SOC'!E34,\"INCOMPLETO RECHAZAR\")","v":"INCOMPLETO RECHAZAR"},343]
[{"$f":"+SOCIOS!A32","v":"e CAP. SUSCR."},{"$f":"+SOCIOS!B32","v":0},{"$f":"+SOCIOS!C32","v":0},{"$f":"+SOCIOS!D32","v":"CAPITAL SUSCRIPTO:"},{"$f":"IF(SOCIOS!E32>0,SOCIOS!E32,\"INCOMPLETO RECHAZAR\")","v":"INCOMPLETO RECHAZAR"},344]
[{"$f":"+SOCIOS!A54","v":"e CAP. SUSCR."},{"$f":"+SOCIOS!B54","v":0},{"$f":"+SOCIOS!C54","v":0},{"$f":"+SOCIOS!D54","v":"CAPITAL SUSCRIPTO:"},{"$f":"IF(SOCIOS!E54>0,SOCIOS!E54,\"INCOMPLETO RECHAZAR\")","v":"INCOMPLETO RECHAZAR"},345]
[{"$f":"+SOCIOS!A76","v":"e CAP. SUSCR."},{"$f":"+SOCIOS!B76","v":0},{"$f":"+SOCIOS!C76","v":0},{"$f":"+SOCIOS!D76","v":"CAPITAL SUSCRIPTO:"},{"$f":"IF(SOCIOS!E76>0,SOCIOS!E76,\"INCOMPLETO RECHAZAR\")","v":"INCOMPLETO RECHAZAR"},346]
[{"$f":"+SOCIOS!A98","v":"e CAP. SUSCR."},{"$f":"+SOCIOS!B98","v":0},{"$f":"+SOCIOS!C98","v":0},{"$f":"+SOCIOS!D98","v":"CAPITAL SUSCRIPTO:"},{"$f":"IF(SOCIOS!E98>0,SOCIOS!E98,\"INCOMPLETO RECHAZAR\")","v":"INCOMPLETO RECHAZAR"},347]
[{"$f":"+SOCIOS!A120","v":"e CAP. SUSCR."},{"$f":"+SOCIOS!B120","v":0},{"$f":"+SOCIOS!C120","v":0},{"$f":"+SOCIOS!D120","v":"CAPITAL SUSCRIPTO:"},{"$f":"IF(SOCIOS!E120>0,SOCIOS!E120,\"INCOMPLETO RECHAZAR\")","v":"INCOMPLETO RECHAZAR"},348]
[{"$f":"+SOCIOS!A142","v":"e CAP. SUSCR."},{"$f":"+SOCIOS!B142","v":0},{"$f":"+SOCIOS!C142","v":0},{"$f":"+SOCIOS!D142","v":"CAPITAL SUSCRIPTO:"},{"$f":"IF(SOCIOS!E142>0,SOCIOS!E142,\"INCOMPLETO RECHAZAR\")","v":"INCOMPLETO RECHAZAR"},349]
[{"$f":"+SOCIOS!A164","v":"e CAP. SUSCR."},{"$f":"+SOCIOS!B164","v":0},{"$f":"+SOCIOS!C164","v":0},{"$f":"+SOCIOS!D164","v":"CAPITAL SUSCRIPTO:"},{"$f":"IF(SOCIOS!E164>0,SOCIOS!E164,\"INCOMPLETO RECHAZAR\")","v":"INCOMPLETO RECHAZAR"},350]
[{"$f":"+SOCIOS!A186","v":"e CAP. SUSCR."},{"$f":"+SOCIOS!B186","v":0},{"$f":"+SOCIOS!C186","v":0},{"$f":"+SOCIOS!D186","v":"CAPITAL SUSCRIPTO:"},{"$f":"IF(SOCIOS!E186>0,SOCIOS!E186,\"INCOMPLETO RECHAZAR\")","v":"INCOMPLETO RECHAZAR"},351]
[{"$f":"+SOCIOS!A208","v":"e CAP. SUSCR."},{"$f":"+SOCIOS!B208","v":0},{"$f":"+SOCIOS!C208","v":0},{"$f":"+SOCIOS!D208","v":"CAPITAL SUSCRIPTO:"},{"$f":"IF(SOCIOS!E208>0,SOCIOS!E208,\"INCOMPLETO RECHAZAR\")","v":"INCOMPLETO RECHAZAR"},352]
[{"$f":"+SOCIOS!A230","v":"e CAP. SUSCR."},{"$f":"+SOCIOS!B230","v":0},{"$f":"+SOCIOS!C230","v":0},{"$f":"+SOCIOS!D230","v":"CAPITAL SUSCRIPTO:"},{"$f":"IF(SOCIOS!E230>0,SOCIOS!E230,\"INCOMPLETO RECHAZAR\")","v":"INCOMPLETO RECHAZAR"},353]
[{"$f":"+SOCIOS!A252","v":"e CAP. SUSCR."},{"$f":"+SOCIOS!B252","v":0},{"$f":"+SOCIOS!C252","v":0},{"$f":"+SOCIOS!D252","v":"CAPITAL SUSCRIPTO:"},{"$f":"IF(SOCIOS!E252>0,SOCIOS!E252,\"INCOMPLETO RECHAZAR\")","v":"INCOMPLETO RECHAZAR"},354]
[{"$f":"+SOCIOS!A274","v":"e CAP. SUSCR."},{"$f":"+SOCIOS!B274","v":0},{"$f":"+SOCIOS!C274","v":0},{"$f":"+SOCIOS!D274","v":"CAPITAL SUSCRIPTO:"},{"$f":"IF(SOCIOS!E274>0,SOCIOS!E274,\"INCOMPLETO RECHAZAR\")","v":"INCOMPLETO RECHAZAR"},355]
[{"$f":"+SOCIOS!A296","v":"e CAP. SUSCR."},{"$f":"+SOCIOS!B296","v":0},{"$f":"+SOCIOS!C296","v":0},{"$f":"+SOCIOS!D296","v":"CAPITAL SUSCRIPTO:"},{"$f":"IF(SOCIOS!E296>0,SOCIOS!E296,\"INCOMPLETO RECHAZAR\")","v":"INCOMPLETO RECHAZAR"},356]
[{"$f":"+SOCIOS!A318","v":"e CAP. SUSCR."},{"$f":"+SOCIOS!B318","v":0},{"$f":"+SOCIOS!C318","v":0},{"$f":"+SOCIOS!D318","v":"CAPITAL SUSCRIPTO:"},{"$f":"IF(SOCIOS!E318>0,SOCIOS!E318,\"INCOMPLETO RECHAZAR\")","v":"INCOMPLETO RECHAZAR"},357]
[{"$f":"+SOCIOS!G29","v":"e CAP. SUSCR."},{"$f":"+SOCIOS!H29","v":0},{"$f":"+SOCIOS!H29","v":0},{"$f":"+SOCIOS!I29","v":"CAPITAL SUSCRIPTO:"},{"$f":"IF(SOCIOS!J29>0,SOCIOS!J29,\"INCOMPLETO RECHAZAR\")","v":"INCOMPLETO RECHAZAR"},358]
[{"$f":"+SOCIOS!G46","v":"e CAP. SUSCR."},{"$f":"+SOCIOS!H46","v":0},{"$f":"+SOCIOS!H46","v":0},{"$f":"+SOCIOS!I46","v":"CAPITAL SUSCRIPTO:"},{"$f":"IF(SOCIOS!J46>0,SOCIOS!J46,\"INCOMPLETO RECHAZAR\")","v":"INCOMPLETO RECHAZAR"},359]
[{"$f":"+SOCIOS!G63","v":"e CAP. SUSCR."},{"$f":"+SOCIOS!H63","v":0},{"$f":"+SOCIOS!H63","v":0},{"$f":"+SOCIOS!I63","v":"CAPITAL SUSCRIPTO:"},{"$f":"IF(SOCIOS!J63>0,SOCIOS!J63,\"INCOMPLETO RECHAZAR\")","v":"INCOMPLETO RECHAZAR"},360]
[{"$f":"+SOCIOS!G80","v":"e CAP. SUSCR."},{"$f":"+SOCIOS!H80","v":0},{"$f":"+SOCIOS!H80","v":0},{"$f":"+SOCIOS!I80","v":"CAPITAL SUSCRIPTO:"},{"$f":"IF(SOCIOS!J80>0,SOCIOS!J80,\"INCOMPLETO RECHAZAR\")","v":"INCOMPLETO RECHAZAR"},361]
[{"$f":"+SOCIOS!G97","v":"e CAP. SUSCR."},{"$f":"+SOCIOS!H97","v":0},{"$f":"+SOCIOS!H97","v":0},{"$f":"+SOCIOS!I97","v":"CAPITAL SUSCRIPTO:"},{"$f":"IF(SOCIOS!J97>0,SOCIOS!J97,\"INCOMPLETO RECHAZAR\")","v":"INCOMPLETO RECHAZAR"},362]
[{"$f":"+SOCIOS!G114","v":"e CAP. SUSCR."},{"$f":"+SOCIOS!H114","v":0},{"$f":"+SOCIOS!H114","v":0},{"$f":"+SOCIOS!I114","v":"CAPITAL SUSCRIPTO:"},{"$f":"IF(SOCIOS!J114>0,SOCIOS!J114,\"INCOMPLETO RECHAZAR\")","v":"INCOMPLETO RECHAZAR"},363]
[{"$f":"+SOCIOS!G131","v":"e CAP. SUSCR."},{"$f":"+SOCIOS!H131","v":0},{"$f":"+SOCIOS!H131","v":0},{"$f":"+SOCIOS!I131","v":"CAPITAL SUSCRIPTO:"},{"$f":"IF(SOCIOS!J131>0,SOCIOS!J131,\"INCOMPLETO RECHAZAR\")","v":"INCOMPLETO RECHAZAR"},364]
[{"$f":"+SOCIOS!G148","v":"e CAP. SUSCR."},{"$f":"+SOCIOS!H148","v":0},{"$f":"+SOCIOS!H148","v":0},{"$f":"+SOCIOS!I148","v":"CAPITAL SUSCRIPTO:"},{"$f":"IF(SOCIOS!J148>0,SOCIOS!J148,\"INCOMPLETO RECHAZAR\")","v":"INCOMPLETO RECHAZAR"},365]
[{"$f":"+SOCIOS!G165","v":"e CAP. SUSCR."},{"$f":"+SOCIOS!H165","v":0},{"$f":"+SOCIOS!H165","v":0},{"$f":"+SOCIOS!I165","v":"CAPITAL SUSCRIPTO:"},{"$f":"IF(SOCIOS!J165>0,SOCIOS!J165,\"INCOMPLETO RECHAZAR\")","v":"INCOMPLETO RECHAZAR"},366]
[{"$f":"+SOCIOS!G182","v":"e CAP. SUSCR."},{"$f":"+SOCIOS!H182","v":0},{"$f":"+SOCIOS!H182","v":0},{"$f":"+SOCIOS!I182","v":"CAPITAL SUSCRIPTO:"},{"$f":"IF(SOCIOS!J182>0,SOCIOS!J182,\"INCOMPLETO RECHAZAR\")","v":"INCOMPLETO RECHAZAR"},367]
[{"$f":"+'SOLICITUD-DATOS SOC'!A32","v":"e CAP. SUSCR. TOT"},{"$f":"UPPER('SOLICITUD-DATOS SOC'!B32)","v":"0"},{"$f":"UPPER('SOLICITUD-DATOS SOC'!C32)","v":"0"},{"$f":"+'SOLICITUD-DATOS SOC'!D32","v":"CAPITAL SOCIAL(SUSCRIPTO):"},{"$f":"IF('SOLICITUD-DATOS SOC'!E32>0,'SOLICITUD-DATOS SOC'!E32,\"INCOMPLETO RECHAZAR\")","v":"INCOMPLETO RECHAZAR"},368]
[{"$f":"+SOCIOS!A34","v":"f PARTICIPACION"},{"$f":"+SOCIOS!B34","v":0},{"$f":"+SOCIOS!C34","v":0},{"$f":"+SOCIOS!D34","v":"PARTICIPACIÓN S/CAPITAL (%):"},{"$f":"IF(SOCIOS!E34>0,SOCIOS!E34,\"INCOMPLETO RECHAZAR\")","v":{"$error":"#DIV/0!"}},369]
[{"$f":"+SOCIOS!A56","v":"f PARTICIPACION"},{"$f":"+SOCIOS!B56","v":0},{"$f":"+SOCIOS!C56","v":0},{"$f":"+SOCIOS!D56","v":"PARTICIPACIÓN S/CAPITAL (%):"},{"$f":"IF(SOCIOS!E56>0,SOCIOS!E56,\"INCOMPLETO RECHAZAR\")","v":{"$error":"#DIV/0!"}},370]
[{"$f":"+SOCIOS!A78","v":"f PARTICIPACION"},{"$f":"+SOCIOS!B78","v":0},{"$f":"+SOCIOS!C78","v":0},{"$f":"+SOCIOS!D78","v":"PARTICIPACIÓN S/CAPITAL (%):"},{"$f":"IF(SOCIOS!E78>0,SOCIOS!E78,\"INCOMPLETO RECHAZAR\")","v":{"$error":"#DIV/0!"}},371]
[{"$f":"+SOCIOS!A100","v":"f PARTICIPACION"},{"$f":"+SOCIOS!B100","v":0},{"$f":"+SOCIOS!C100","v":0},{"$f":"+SOCIOS!D100","v":"PARTICIPACIÓN S/CAPITAL (%):"},{"$f":"IF(SOCIOS!E100>0,SOCIOS!E100,\"INCOMPLETO RECHAZAR\")","v":{"$error":"#DIV/0!"}},372]
[{"$f":"+SOCIOS!A122","v":"f PARTICIPACION"},{"$f":"+SOCIOS!B122","v":0},{"$f":"+SOCIOS!C122","v":0},{"$f":"+SOCIOS!D122","v":"PARTICIPACIÓN S/CAPITAL (%):"},{"$f":"IF(SOCIOS!E122>0,SOCIOS!E122,\"INCOMPLETO RECHAZAR\")","v":{"$error":"#DIV/0!"}},373]
[{"$f":"+SOCIOS!A144","v":"f PARTICIPACION"},{"$f":"+SOCIOS!B144","v":0},{"$f":"+SOCIOS!C144","v":0},{"$f":"+SOCIOS!D144","v":"PARTICIPACIÓN S/CAPITAL (%):"},{"$f":"IF(SOCIOS!E144>0,SOCIOS!E144,\"INCOMPLETO RECHAZAR\")","v":{"$error":"#DIV/0!"}},374]
[{"$f":"+SOCIOS!A166","v":"f PARTICIPACION"},{"$f":"+SOCIOS!B166","v":0},{"$f":"+SOCIOS!C166","v":0},{"$f":"+SOCIOS!D166","v":"PARTICIPACIÓN S/CAPITAL (%):"},{"$f":"IF(SOCIOS!E166>0,SOCIOS!E166,\"INCOMPLETO RECHAZAR\")","v":{"$error":"#DIV/0!"}},375]
[{"$f":"+SOCIOS!A188","v":"f PARTICIPACION"},{"$f":"+SOCIOS!B188","v":0},{"$f":"+SOCIOS!C188","v":0},{"$f":"+SOCIOS!D188","v":"PARTICIPACIÓN S/CAPITAL (%):"},{"$f":"IF(SOCIOS!E188>0,SOCIOS!E188,\"INCOMPLETO RECHAZAR\")","v":{"$error":"#DIV/0!"}},376]
[{"$f":"+SOCIOS!A210","v":"f PARTICIPACION"},{"$f":"+SOCIOS!B210","v":0},{"$f":"+SOCIOS!C210","v":0},{"$f":"+SOCIOS!D210","v":"PARTICIPACIÓN S/CAPITAL (%):"},{"$f":"IF(SOCIOS!E210>0,SOCIOS!E210,\"INCOMPLETO RECHAZAR\")","v":{"$error":"#DIV/0!"}},377]
[{"$f":"+SOCIOS!A232","v":"f PARTICIPACION"},{"$f":"+SOCIOS!B232","v":0},{"$f":"+SOCIOS!C232","v":0},{"$f":"+SOCIOS!D232","v":"PARTICIPACIÓN S/CAPITAL (%):"},{"$f":"IF(SOCIOS!E232>0,SOCIOS!E232,\"INCOMPLETO RECHAZAR\")","v":{"$error":"#DIV/0!"}},378]
[{"$f":"+SOCIOS!A254","v":"f PARTICIPACION"},{"$f":"+SOCIOS!B254","v":0},{"$f":"+SOCIOS!C254","v":0},{"$f":"+SOCIOS!D254","v":"PARTICIPACIÓN S/CAPITAL (%):"},{"$f":"IF(SOCIOS!E254>0,SOCIOS!E254,\"INCOMPLETO RECHAZAR\")","v":{"$error":"#DIV/0!"}},379]
[{"$f":"+SOCIOS!A276","v":"f PARTICIPACION"},{"$f":"+SOCIOS!B276","v":0},{"$f":"+SOCIOS!C276","v":0},{"$f":"+SOCIOS!D276","v":"PARTICIPACIÓN S/CAPITAL (%):"},{"$f":"IF(SOCIOS!E276>0,SOCIOS!E276,\"INCOMPLETO RECHAZAR\")","v":{"$error":"#DIV/0!"}},380]
[{"$f":"+SOCIOS!A298","v":"f PARTICIPACION"},{"$f":"+SOCIOS!B298","v":0},{"$f":"+SOCIOS!C298","v":0},{"$f":"+SOCIOS!D298","v":"PARTICIPACIÓN S/CAPITAL (%):"},{"$f":"IF(SOCIOS!E298>0,SOCIOS!E298,\"INCOMPLETO RECHAZAR\")","v":{"$error":"#DIV/0!"}},381]
[{"$f":"+SOCIOS!A320","v":"f PARTICIPACION"},{"$f":"+SOCIOS!B320","v":0},{"$f":"+SOCIOS!C320","v":0},{"$f":"+SOCIOS!D320","v":"PARTICIPACIÓN S/CAPITAL (%):"},{"$f":"IF(SOCIOS!E320>0,SOCIOS!E320,\"INCOMPLETO RECHAZAR\")","v":{"$error":"#DIV/0!"}},382]
[{"$f":"+SOCIOS!G31","v":"f PARTICIPACION"},{"$f":"+SOCIOS!H31","v":0},{"$f":"+SOCIOS!H31","v":0},{"$f":"+SOCIOS!I31","v":"PARTICIPACIÓN S/CAPITAL (%):"},{"$f":"IF(SOCIOS!J31>0,SOCIOS!J31,\"INCOMPLETO RECHAZAR\")","v":{"$error":"#DIV/0!"}},383]
[{"$f":"+SOCIOS!G48","v":"f PARTICIPACION"},{"$f":"+SOCIOS!H48","v":0},{"$f":"+SOCIOS!H48","v":0},{"$f":"+SOCIOS!I48","v":"PARTICIPACIÓN S/CAPITAL (%):"},{"$f":"IF(SOCIOS!J48>0,SOCIOS!J48,\"INCOMPLETO RECHAZAR\")","v":{"$error":"#DIV/0!"}},384]
[{"$f":"+SOCIOS!G65","v":"f PARTICIPACION"},{"$f":"+SOCIOS!H65","v":0},{"$f":"+SOCIOS!H65","v":0},{"$f":"+SOCIOS!I65","v":"PARTICIPACIÓN S/CAPITAL (%):"},{"$f":"IF(SOCIOS!J65>0,SOCIOS!J65,\"INCOMPLETO RECHAZAR\")","v":{"$error":"#DIV/0!"}},385]
[{"$f":"+SOCIOS!G82","v":"f PARTICIPACION"},{"$f":"+SOCIOS!H82","v":0},{"$f":"+SOCIOS!H82","v":0},{"$f":"+SOCIOS!I82","v":"PARTICIPACIÓN S/CAPITAL (%):"},{"$f":"IF(SOCIOS!J82>0,SOCIOS!J82,\"INCOMPLETO RECHAZAR\")","v":{"$error":"#DIV/0!"}},386]
[{"$f":"+SOCIOS!G99","v":"f PARTICIPACION"},{"$f":"+SOCIOS!H99","v":0},{"$f":"+SOCIOS!H99","v":0},{"$f":"+SOCIOS!I99","v":"PARTICIPACIÓN S/CAPITAL (%):"},{"$f":"IF(SOCIOS!J99>0,SOCIOS!J99,\"INCOMPLETO RECHAZAR\")","v":{"$error":"#DIV/0!"}},387]
[{"$f":"+SOCIOS!G116","v":"f PARTICIPACION"},{"$f":"+SOCIOS!H116","v":0},{"$f":"+SOCIOS!H116","v":0},{"$f":"+SOCIOS!I116","v":"PARTICIPACIÓN S/CAPITAL (%):"},{"$f":"IF(SOCIOS!J116>0,SOCIOS!J116,\"INCOMPLETO RECHAZAR\")","v":{"$error":"#DIV/0!"}},388]
[{"$f":"+SOCIOS!G133","v":"f PARTICIPACION"},{"$f":"+SOCIOS!H133","v":0},{"$f":"+SOCIOS!H133","v":0},{"$f":"+SOCIOS!I133","v":"PARTICIPACIÓN S/CAPITAL (%):"},{"$f":"IF(SOCIOS!J133>0,SOCIOS!J133,\"INCOMPLETO RECHAZAR\")","v":{"$error":"#DIV/0!"}},389]
[{"$f":"+SOCIOS!G150","v":"f PARTICIPACION"},{"$f":"+SOCIOS!H150","v":0},{"$f":"+SOCIOS!H150","v":0},{"$f":"+SOCIOS!I150","v":"PARTICIPACIÓN S/CAPITAL (%):"},{"$f":"IF(SOCIOS!J150>0,SOCIOS!J150,\"INCOMPLETO RECHAZAR\")","v":{"$error":"#DIV/0!"}},390]
[{"$f":"+SOCIOS!G167","v":"f PARTICIPACION"},{"$f":"+SOCIOS!H167","v":0},{"$f":"+SOCIOS!H167","v":0},{"$f":"+SOCIOS!I167","v":"PARTICIPACIÓN S/CAPITAL (%):"},{"$f":"IF(SOCIOS!J167>0,SOCIOS!J167,\"INCOMPLETO RECHAZAR\")","v":{"$error":"#DIV/0!"}},391]
[{"$f":"+SOCIOS!G184","v":"f PARTICIPACION"},{"$f":"+SOCIOS!H184","v":0},{"$f":"+SOCIOS!H184","v":0},{"$f":"+SOCIOS!I184","v":"PARTICIPACIÓN S/CAPITAL (%):"},{"$f":"IF(SOCIOS!J184>0,SOCIOS!J184,\"INCOMPLETO RECHAZAR\")","v":{"$error":"#DIV/0!"}},392]
[{"$f":"+SOCIOS!G27","v":"g AP. DINERO"},{"$f":"+SOCIOS!H27","v":0},{"$f":"+SOCIOS!H27","v":0},{"$f":"+SOCIOS!I27","v":"APORTE EN DINERO:"},{"$f":"IF(SOCIOS!J27>0,SOCIOS!J27,\"INCOMPLETO RECHAZAR\")","v":"INCOMPLETO RECHAZAR"},393]
[{"$f":"+SOCIOS!G44","v":"g AP. DINERO"},{"$f":"+SOCIOS!H44","v":0},{"$f":"+SOCIOS!H44","v":0},{"$f":"+SOCIOS!I44","v":"APORTE EN DINERO:"},{"$f":"IF(SOCIOS!J44>0,SOCIOS!J44,\"INCOMPLETO RECHAZAR\")","v":"INCOMPLETO RECHAZAR"},394]
[{"$f":"+SOCIOS!G61","v":"g AP. DINERO"},{"$f":"+SOCIOS!H61","v":0},{"$f":"+SOCIOS!H61","v":0},{"$f":"+SOCIOS!I61","v":"APORTE EN DINERO:"},{"$f":"IF(SOCIOS!J61>0,SOCIOS!J61,\"INCOMPLETO RECHAZAR\")","v":"INCOMPLETO RECHAZAR"},395]
[{"$f":"+SOCIOS!G78","v":"g AP. DINERO"},{"$f":"+SOCIOS!H78","v":0},{"$f":"+SOCIOS!H78","v":0},{"$f":"+SOCIOS!I78","v":"APORTE EN DINERO:"},{"$f":"IF(SOCIOS!J78>0,SOCIOS!J78,\"INCOMPLETO RECHAZAR\")","v":"INCOMPLETO RECHAZAR"},396]
[{"$f":"+SOCIOS!G95","v":"g AP. DINERO"},{"$f":"+SOCIOS!H95","v":0},{"$f":"+SOCIOS!H95","v":0},{"$f":"+SOCIOS!I95","v":"APORTE EN DINERO:"},{"$f":"IF(SOCIOS!J95>0,SOCIOS!J95,\"INCOMPLETO RECHAZAR\")","v":"INCOMPLETO RECHAZAR"},397]
[{"$f":"+SOCIOS!G112","v":"g AP. DINERO"},{"$f":"+SOCIOS!H112","v":0},{"$f":"+SOCIOS!H112","v":0},{"$f":"+SOCIOS!I112","v":"APORTE EN DINERO:"},{"$f":"IF(SOCIOS!J112>0,SOCIOS!J112,\"INCOMPLETO RECHAZAR\")","v":"INCOMPLETO RECHAZAR"},398]
[{"$f":"+SOCIOS!G129","v":"g AP. DINERO"},{"$f":"+SOCIOS!H129","v":0},{"$f":"+SOCIOS!H129","v":0},{"$f":"+SOCIOS!I129","v":"APORTE EN DINERO:"},{"$f":"IF(SOCIOS!J129>0,SOCIOS!J129,\"INCOMPLETO RECHAZAR\")","v":"INCOMPLETO RECHAZAR"},399]
[{"$f":"+SOCIOS!G146","v":"g AP. DINERO"},{"$f":"+SOCIOS!H146","v":0},{"$f":"+SOCIOS!H146","v":0},{"$f":"+SOCIOS!I146","v":"APORTE EN DINERO:"},{"$f":"IF(SOCIOS!J146>0,SOCIOS!J146,\"INCOMPLETO RECHAZAR\")","v":"INCOMPLETO RECHAZAR"},400]
[{"$f":"+SOCIOS!G163","v":"g AP. DINERO"},{"$f":"+SOCIOS!H163","v":0},{"$f":"+SOCIOS!H163","v":0},{"$f":"+SOCIOS!I163","v":"APORTE EN DINERO:"},{"$f":"IF(SOCIOS!J163>0,SOCIOS!J163,\"INCOMPLETO RECHAZAR\")","v":"INCOMPLETO RECHAZAR"},401]
[{"$f":"+SOCIOS!G180","v":"g AP. DINERO"},{"$f":"+SOCIOS!H180","v":0},{"$f":"+SOCIOS!H180","v":0},{"$f":"+SOCIOS!I180","v":"APORTE EN DINERO:"},{"$f":"IF(SOCIOS!J180>0,SOCIOS!J180,\"INCOMPLETO RECHAZAR\")","v":"INCOMPLETO RECHAZAR"},402]
[{"$f":"+SOCIOS!A30","v":"g AP. DINERO"},{"$f":"+SOCIOS!B30","v":0},{"$f":"+SOCIOS!C30","v":0},{"$f":"+SOCIOS!D30","v":"APORTE EN DINERO:"},{"$f":"IF(SOCIOS!E30>0,SOCIOS!E30,\"INCOMPLETO RECHAZAR\")","v":"INCOMPLETO RECHAZAR"},403]
[{"$f":"+SOCIOS!A52","v":"g AP. DINERO"},{"$f":"+SOCIOS!B52","v":0},{"$f":"+SOCIOS!C52","v":0},{"$f":"+SOCIOS!D52","v":"APORTE EN DINERO:"},{"$f":"IF(SOCIOS!E52>0,SOCIOS!E52,\"INCOMPLETO RECHAZAR\")","v":"INCOMPLETO RECHAZAR"},404]
[{"$f":"+SOCIOS!A74","v":"g AP. DINERO"},{"$f":"+SOCIOS!B74","v":0},{"$f":"+SOCIOS!C74","v":0},{"$f":"+SOCIOS!D74","v":"APORTE EN DINERO:"},{"$f":"IF(SOCIOS!E74>0,SOCIOS!E74,\"INCOMPLETO RECHAZAR\")","v":"INCOMPLETO RECHAZAR"},405]
[{"$f":"+SOCIOS!A96","v":"g AP. DINERO"},{"$f":"+SOCIOS!B96","v":0},{"$f":"+SOCIOS!C96","v":0},{"$f":"+SOCIOS!D96","v":"APORTE EN DINERO:"},{"$f":"IF(SOCIOS!E96>0,SOCIOS!E96,\"INCOMPLETO RECHAZAR\")","v":"INCOMPLETO RECHAZAR"},406]
[{"$f":"+SOCIOS!A118","v":"g AP. DINERO"},{"$f":"+SOCIOS!B118","v":0},{"$f":"+SOCIOS!C118","v":0},{"$f":"+SOCIOS!D118","v":"APORTE EN DINERO:"},{"$f":"IF(SOCIOS!E118>0,SOCIOS!E118,\"INCOMPLETO RECHAZAR\")","v":"INCOMPLETO RECHAZAR"},407]
[{"$f":"+SOCIOS!A140","v":"g AP. DINERO"},{"$f":"+SOCIOS!B140","v":0},{"$f":"+SOCIOS!C140","v":0},{"$f":"+SOCIOS!D140","v":"APORTE EN DINERO:"},{"$f":"IF(SOCIOS!E140>0,SOCIOS!E140,\"INCOMPLETO RECHAZAR\")","v":"INCOMPLETO RECHAZAR"},408]
[{"$f":"+SOCIOS!A162","v":"g AP. DINERO"},{"$f":"+SOCIOS!B162","v":0},{"$f":"+SOCIOS!C162","v":0},{"$f":"+SOCIOS!D162","v":"APORTE EN DINERO:"},{"$f":"IF(SOCIOS!E162>0,SOCIOS!E162,\"INCOMPLETO RECHAZAR\")","v":"INCOMPLETO RECHAZAR"},409]
[{"$f":"+SOCIOS!A184","v":"g AP. DINERO"},{"$f":"+SOCIOS!B184","v":0},{"$f":"+SOCIOS!C184","v":0},{"$f":"+SOCIOS!D184","v":"APORTE EN DINERO:"},{"$f":"IF(SOCIOS!E184>0,SOCIOS!E184,\"INCOMPLETO RECHAZAR\")","v":"INCOMPLETO RECHAZAR"},410]
[{"$f":"+SOCIOS!A206","v":"g AP. DINERO"},{"$f":"+SOCIOS!B206","v":0},{"$f":"+SOCIOS!C206","v":0},{"$f":"+SOCIOS!D206","v":"APORTE EN DINERO:"},{"$f":"IF(SOCIOS!E206>0,SOCIOS!E206,\"INCOMPLETO RECHAZAR\")","v":"INCOMPLETO RECHAZAR"},411]
[{"$f":"+SOCIOS!A228","v":"g AP. DINERO"},{"$f":"+SOCIOS!B228","v":0},{"$f":"+SOCIOS!C228","v":0},{"$f":"+SOCIOS!D228","v":"APORTE EN DINERO:"},{"$f":"IF(SOCIOS!E228>0,SOCIOS!E228,\"INCOMPLETO RECHAZAR\")","v":"INCOMPLETO RECHAZAR"},412]
[{"$f":"+SOCIOS!A250","v":"g AP. DINERO"},{"$f":"+SOCIOS!B250","v":0},{"$f":"+SOCIOS!C250","v":0},{"$f":"+SOCIOS!D250","v":"APORTE EN DINERO:"},{"$f":"IF(SOCIOS!E250>0,SOCIOS!E250,\"INCOMPLETO RECHAZAR\")","v":"INCOMPLETO RECHAZAR"},413]
[{"$f":"+SOCIOS!A272","v":"g AP. DINERO"},{"$f":"+SOCIOS!B272","v":0},{"$f":"+SOCIOS!C272","v":0},{"$f":"+SOCIOS!D272","v":"APORTE EN DINERO:"},{"$f":"IF(SOCIOS!E272>0,SOCIOS!E272,\"INCOMPLETO RECHAZAR\")","v":"INCOMPLETO RECHAZAR"},414]
[{"$f":"+SOCIOS!A294","v":"g AP. DINERO"},{"$f":"+SOCIOS!B294","v":0},{"$f":"+SOCIOS!C294","v":0},{"$f":"+SOCIOS!D294","v":"APORTE EN DINERO:"},{"$f":"IF(SOCIOS!E294>0,SOCIOS!E294,\"INCOMPLETO RECHAZAR\")","v":"INCOMPLETO RECHAZAR"},415]
[{"$f":"+SOCIOS!A316","v":"g AP. DINERO"},{"$f":"+SOCIOS!B316","v":0},{"$f":"+SOCIOS!C316","v":0},{"$f":"+SOCIOS!D316","v":"APORTE EN DINERO:"},{"$f":"IF(SOCIOS!E316>0,SOCIOS!E316,\"INCOMPLETO RECHAZAR\")","v":"INCOMPLETO RECHAZAR"},416]
[{"$f":"+SOCIOS!G28","v":"g AP. ESPECIE"},{"$f":"+SOCIOS!H28","v":0},{"$f":"+SOCIOS!H28","v":0},{"$f":"+SOCIOS!I28","v":"APORTE EN ESPECIE (BS. NO DINERARIOS):"},{"$f":"IF(SOCIOS!J28>0,SOCIOS!J28,\"INCOMPLETO RECHAZAR\")","v":"INCOMPLETO RECHAZAR"},417]
[{"$f":"+SOCIOS!G45","v":"g AP. ESPECIE"},{"$f":"+SOCIOS!H45","v":0},{"$f":"+SOCIOS!H45","v":0},{"$f":"+SOCIOS!I45","v":"APORTE EN ESPECIE (BS. NO DINERARIOS):"},{"$f":"IF(SOCIOS!J45>0,SOCIOS!J45,\"INCOMPLETO RECHAZAR\")","v":"INCOMPLETO RECHAZAR"},418]
[{"$f":"+SOCIOS!G62","v":"g AP. ESPECIE"},{"$f":"+SOCIOS!H62","v":0},{"$f":"+SOCIOS!H62","v":0},{"$f":"+SOCIOS!I62","v":"APORTE EN ESPECIE (BS. NO DINERARIOS):"},{"$f":"IF(SOCIOS!J62>0,SOCIOS!J62,\"INCOMPLETO RECHAZAR\")","v":"INCOMPLETO RECHAZAR"},419]
[{"$f":"+SOCIOS!G79","v":"g AP. ESPECIE"},{"$f":"+SOCIOS!H79","v":0},{"$f":"+SOCIOS!H79","v":0},{"$f":"+SOCIOS!I79","v":"APORTE EN ESPECIE (BS. NO DINERARIOS):"},{"$f":"IF(SOCIOS!J79>0,SOCIOS!J79,\"INCOMPLETO RECHAZAR\")","v":"INCOMPLETO RECHAZAR"},420]
[{"$f":"+SOCIOS!G96","v":"g AP. ESPECIE"},{"$f":"+SOCIOS!H96","v":0},{"$f":"+SOCIOS!H96","v":0},{"$f":"+SOCIOS!I96","v":"APORTE EN ESPECIE (BS. NO DINERARIOS):"},{"$f":"IF(SOCIOS!J96>0,SOCIOS!J96,\"INCOMPLETO RECHAZAR\")","v":"INCOMPLETO RECHAZAR"},421]
[{"$f":"+SOCIOS!G113","v":"g AP. ESPECIE"},{"$f":"+SOCIOS!H113","v":0},{"$f":"+SOCIOS!H113","v":0},{"$f":"+SOCIOS!I113","v":"APORTE EN ESPECIE (BS. NO DINERARIOS):"},{"$f":"IF(SOCIOS!J113>0,SOCIOS!J113,\"INCOMPLETO RECHAZAR\")","v":"INCOMPLETO RECHAZAR"},422]
[{"$f":"+SOCIOS!G130","v":"g AP. ESPECIE"},{"$f":"+SOCIOS!H130","v":0},{"$f":"+SOCIOS!H130","v":0},{"$f":"+SOCIOS!I130","v":"APORTE EN ESPECIE (BS. NO DINERARIOS):"},{"$f":"IF(SOCIOS!J130>0,SOCIOS!J130,\"INCOMPLETO RECHAZAR\")","v":"INCOMPLETO RECHAZAR"},423]
[{"$f":"+SOCIOS!G147","v":"g AP. ESPECIE"},{"$f":"+SOCIOS!H147","v":0},{"$f":"+SOCIOS!H147","v":0},{"$f":"+SOCIOS!I147","v":"APORTE EN ESPECIE (BS. NO DINERARIOS):"},{"$f":"IF(SOCIOS!J147>0,SOCIOS!J147,\"INCOMPLETO RECHAZAR\")","v":"INCOMPLETO RECHAZAR"},424]
[{"$f":"+SOCIOS!G164","v":"g AP. ESPECIE"},{"$f":"+SOCIOS!H164","v":0},{"$f":"+SOCIOS!H164","v":0},{"$f":"+SOCIOS!I164","v":"APORTE EN ESPECIE (BS. NO DINERARIOS):"},{"$f":"IF(SOCIOS!J164>0,SOCIOS!J164,\"INCOMPLETO RECHAZAR\")","v":"INCOMPLETO RECHAZAR"},425]
[{"$f":"+SOCIOS!G181","v":"g AP. ESPECIE"},{"$f":"+SOCIOS!H181","v":0},{"$f":"+SOCIOS!H181","v":0},{"$f":"+SOCIOS!I181","v":"APORTE EN ESPECIE (BS. NO DINERARIOS):"},{"$f":"IF(SOCIOS!J181>0,SOCIOS!J181,\"INCOMPLETO RECHAZAR\")","v":"INCOMPLETO RECHAZAR"},426]
[{"$f":"+SOCIOS!A31","v":"g AP. ESPECIE"},{"$f":"+SOCIOS!B31","v":0},{"$f":"+SOCIOS!C31","v":0},{"$f":"+SOCIOS!D31","v":"APORTE EN ESPECIE (BS. NO DINERARIOS):"},{"$f":"IF(SOCIOS!E31>0,SOCIOS!E31,\"INCOMPLETO RECHAZAR\")","v":"INCOMPLETO RECHAZAR"},427]
[{"$f":"+SOCIOS!A53","v":"g AP. ESPECIE"},{"$f":"+SOCIOS!B53","v":0},{"$f":"+SOCIOS!C53","v":0},{"$f":"+SOCIOS!D53","v":"APORTE EN ESPECIE (BS. NO DINERARIOS):"},{"$f":"IF(SOCIOS!E53>0,SOCIOS!E53,\"INCOMPLETO RECHAZAR\")","v":"INCOMPLETO RECHAZAR"},428]
[{"$f":"+SOCIOS!A75","v":"g AP. ESPECIE"},{"$f":"+SOCIOS!B75","v":0},{"$f":"+SOCIOS!C75","v":0},{"$f":"+SOCIOS!D75","v":"APORTE EN ESPECIE (BS. NO DINERARIOS):"},{"$f":"IF(SOCIOS!E75>0,SOCIOS!E75,\"INCOMPLETO RECHAZAR\")","v":"INCOMPLETO RECHAZAR"},429]
[{"$f":"+SOCIOS!A97","v":"g AP. ESPECIE"},{"$f":"+SOCIOS!B97","v":0},{"$f":"+SOCIOS!C97","v":0},{"$f":"+SOCIOS!D97","v":"APORTE EN ESPECIE (BS. NO DINERARIOS):"},{"$f":"IF(SOCIOS!E97>0,SOCIOS!E97,\"INCOMPLETO RECHAZAR\")","v":"INCOMPLETO RECHAZAR"},430]
[{"$f":"+SOCIOS!A119","v":"g AP. ESPECIE"},{"$f":"+SOCIOS!B119","v":0},{"$f":"+SOCIOS!C119","v":0},{"$f":"+SOCIOS!D119","v":"APORTE EN ESPECIE (BS. NO DINERARIOS):"},{"$f":"IF(SOCIOS!E119>0,SOCIOS!E119,\"INCOMPLETO RECHAZAR\")","v":"INCOMPLETO RECHAZAR"},431]
[{"$f":"+SOCIOS!A141","v":"g AP. ESPECIE"},{"$f":"+SOCIOS!B141","v":0},{"$f":"+SOCIOS!C141","v":0},{"$f":"+SOCIOS!D141","v":"APORTE EN ESPECIE (BS. NO DINERARIOS):"},{"$f":"IF(SOCIOS!E141>0,SOCIOS!E141,\"INCOMPLETO RECHAZAR\")","v":"INCOMPLETO RECHAZAR"},432]
[{"$f":"+SOCIOS!A163","v":"g AP. ESPECIE"},{"$f":"+SOCIOS!B163","v":0},{"$f":"+SOCIOS!C163","v":0},{"$f":"+SOCIOS!D163","v":"APORTE EN ESPECIE (BS. NO DINERARIOS):"},{"$f":"IF(SOCIOS!E163>0,SOCIOS!E163,\"INCOMPLETO RECHAZAR\")","v":"INCOMPLETO RECHAZAR"},433]
[{"$f":"+SOCIOS!A185","v":"g AP. ESPECIE"},{"$f":"+SOCIOS!B185","v":0},{"$f":"+SOCIOS!C185","v":0},{"$f":"+SOCIOS!D185","v":"APORTE EN ESPECIE (BS. NO DINERARIOS):"},{"$f":"IF(SOCIOS!E185>0,SOCIOS!E185,\"INCOMPLETO RECHAZAR\")","v":"INCOMPLETO RECHAZAR"},434]
[{"$f":"+SOCIOS!A207","v":"g AP. ESPECIE"},{"$f":"+SOCIOS!B207","v":0},{"$f":"+SOCIOS!C207","v":0},{"$f":"+SOCIOS!D207","v":"APORTE EN ESPECIE (BS. NO DINERARIOS):"},{"$f":"IF(SOCIOS!E207>0,SOCIOS!E207,\"INCOMPLETO RECHAZAR\")","v":"INCOMPLETO RECHAZAR"},435]
[{"$f":"+SOCIOS!A229","v":"g AP. ESPECIE"},{"$f":"+SOCIOS!B229","v":0},{"$f":"+SOCIOS!C229","v":0},{"$f":"+SOCIOS!D229","v":"APORTE EN ESPECIE (BS. NO DINERARIOS):"},{"$f":"IF(SOCIOS!E229>0,SOCIOS!E229,\"INCOMPLETO RECHAZAR\")","v":"INCOMPLETO RECHAZAR"},436]
[{"$f":"+SOCIOS!A251","v":"g AP. ESPECIE"},{"$f":"+SOCIOS!B251","v":0},{"$f":"+SOCIOS!C251","v":0},{"$f":"+SOCIOS!D251","v":"APORTE EN ESPECIE (BS. NO DINERARIOS):"},{"$f":"IF(SOCIOS!E251>0,SOCIOS!E251,\"INCOMPLETO RECHAZAR\")","v":"INCOMPLETO RECHAZAR"},437]
[{"$f":"+SOCIOS!A273","v":"g AP. ESPECIE"},{"$f":"+SOCIOS!B273","v":0},{"$f":"+SOCIOS!C273","v":0},{"$f":"+SOCIOS!D273","v":"APORTE EN ESPECIE (BS. NO DINERARIOS):"},{"$f":"IF(SOCIOS!E273>0,SOCIOS!E273,\"INCOMPLETO RECHAZAR\")","v":"INCOMPLETO RECHAZAR"},438]
[{"$f":"+SOCIOS!A295","v":"g AP. ESPECIE"},{"$f":"+SOCIOS!B295","v":0},{"$f":"+SOCIOS!C295","v":0},{"$f":"+SOCIOS!D295","v":"APORTE EN ESPECIE (BS. NO DINERARIOS):"},{"$f":"IF(SOCIOS!E295>0,SOCIOS!E295,\"INCOMPLETO RECHAZAR\")","v":"INCOMPLETO RECHAZAR"},439]
[{"$f":"+SOCIOS!A317","v":"g AP. ESPECIE"},{"$f":"+SOCIOS!B317","v":0},{"$f":"+SOCIOS!C317","v":0},{"$f":"+SOCIOS!D317","v":"APORTE EN ESPECIE (BS. NO DINERARIOS):"},{"$f":"IF(SOCIOS!E317>0,SOCIOS!E317,\"INCOMPLETO RECHAZAR\")","v":"INCOMPLETO RECHAZAR"},440]
[{"$f":"+SOCIOS!A33","v":"h CAP. INTEG."},{"$f":"+SOCIOS!B33","v":0},{"$f":"+SOCIOS!C33","v":0},{"$f":"+SOCIOS!D33","v":"CAPITAL A INTEGRAR (MÍNIMO):"},{"$f":"IF(SOCIOS!E33>0,SOCIOS!E33,\"INCOMPLETO RECHAZAR\")","v":"INCOMPLETO RECHAZAR"},441]
[{"$f":"+SOCIOS!A55","v":"h CAP. INTEG."},{"$f":"+SOCIOS!B55","v":0},{"$f":"+SOCIOS!C55","v":0},{"$f":"+SOCIOS!D55","v":"CAPITAL A INTEGRAR (MÍNIMO):"},{"$f":"IF(SOCIOS!E55>0,SOCIOS!E55,\"INCOMPLETO RECHAZAR\")","v":"INCOMPLETO RECHAZAR"},442]
[{"$f":"+SOCIOS!A77","v":"h CAP. INTEG."},{"$f":"+SOCIOS!B77","v":0},{"$f":"+SOCIOS!C77","v":0},{"$f":"+SOCIOS!D77","v":"CAPITAL A INTEGRAR (MÍNIMO):"},{"$f":"IF(SOCIOS!E77>0,SOCIOS!E77,\"INCOMPLETO RECHAZAR\")","v":"INCOMPLETO RECHAZAR"},443]
[{"$f":"+SOCIOS!A99","v":"h CAP. INTEG."},{"$f":"+SOCIOS!B99","v":0},{"$f":"+SOCIOS!C99","v":0},{"$f":"+SOCIOS!D99","v":"CAPITAL A INTEGRAR (MÍNIMO):"},{"$f":"IF(SOCIOS!E99>0,SOCIOS!E99,\"INCOMPLETO RECHAZAR\")","v":"INCOMPLETO RECHAZAR"},444]
[{"$f":"+SOCIOS!A121","v":"h CAP. INTEG."},{"$f":"+SOCIOS!B121","v":0},{"$f":"+SOCIOS!C121","v":0},{"$f":"+SOCIOS!D121","v":"CAPITAL A INTEGRAR (MÍNIMO):"},{"$f":"IF(SOCIOS!E121>0,SOCIOS!E121,\"INCOMPLETO RECHAZAR\")","v":"INCOMPLETO RECHAZAR"},445]
[{"$f":"+SOCIOS!A143","v":"h CAP. INTEG."},{"$f":"+SOCIOS!B143","v":0},{"$f":"+SOCIOS!C143","v":0},{"$f":"+SOCIOS!D143","v":"CAPITAL A INTEGRAR (MÍNIMO):"},{"$f":"IF(SOCIOS!E143>0,SOCIOS!E143,\"INCOMPLETO RECHAZAR\")","v":"INCOMPLETO RECHAZAR"},446]
[{"$f":"+SOCIOS!A165","v":"h CAP. INTEG."},{"$f":"+SOCIOS!B165","v":0},{"$f":"+SOCIOS!C165","v":0},{"$f":"+SOCIOS!D165","v":"CAPITAL A INTEGRAR (MÍNIMO):"},{"$f":"IF(SOCIOS!E165>0,SOCIOS!E165,\"INCOMPLETO RECHAZAR\")","v":"INCOMPLETO RECHAZAR"},447]
[{"$f":"+SOCIOS!A187","v":"h CAP. INTEG."},{"$f":"+SOCIOS!B187","v":0},{"$f":"+SOCIOS!C187","v":0},{"$f":"+SOCIOS!D187","v":"CAPITAL A INTEGRAR (MÍNIMO):"},{"$f":"IF(SOCIOS!E187>0,SOCIOS!E187,\"INCOMPLETO RECHAZAR\")","v":"INCOMPLETO RECHAZAR"},448]
[{"$f":"+SOCIOS!A209","v":"h CAP. INTEG."},{"$f":"+SOCIOS!B209","v":0},{"$f":"+SOCIOS!C209","v":0},{"$f":"+SOCIOS!D209","v":"CAPITAL A INTEGRAR (MÍNIMO):"},{"$f":"IF(SOCIOS!E209>0,SOCIOS!E209,\"INCOMPLETO RECHAZAR\")","v":"INCOMPLETO RECHAZAR"},449]
[{"$f":"+SOCIOS!A231","v":"h CAP. INTEG."},{"$f":"+SOCIOS!B231","v":0},{"$f":"+SOCIOS!C231","v":0},{"$f":"+SOCIOS!D231","v":"CAPITAL A INTEGRAR (MÍNIMO):"},{"$f":"IF(SOCIOS!E231>0,SOCIOS!E231,\"INCOMPLETO RECHAZAR\")","v":"INCOMPLETO RECHAZAR"},450]
[{"$f":"+SOCIOS!A253","v":"h CAP. INTEG."},{"$f":"+SOCIOS!B253","v":0},{"$f":"+SOCIOS!C253","v":0},{"$f":"+SOCIOS!D253","v":"CAPITAL A INTEGRAR (MÍNIMO):"},{"$f":"IF(SOCIOS!E253>0,SOCIOS!E253,\"INCOMPLETO RECHAZAR\")","v":"INCOMPLETO RECHAZAR"},451]
[{"$f":"+SOCIOS!A275","v":"h CAP. INTEG."},{"$f":"+SOCIOS!B275","v":0},{"$f":"+SOCIOS!C275","v":0},{"$f":"+SOCIOS!D275","v":"CAPITAL A INTEGRAR (MÍNIMO):"},{"$f":"IF(SOCIOS!E275>0,SOCIOS!E275,\"INCOMPLETO RECHAZAR\")","v":"INCOMPLETO RECHAZAR"},452]
[{"$f":"+SOCIOS!A297","v":"h CAP. INTEG."},{"$f":"+SOCIOS!B297","v":0},{"$f":"+SOCIOS!C297","v":0},{"$f":"+SOCIOS!D297","v":"CAPITAL A INTEGRAR (MÍNIMO):"},{"$f":"IF(SOCIOS!E297>0,SOCIOS!E297,\"INCOMPLETO RECHAZAR\")","v":"INCOMPLETO RECHAZAR"},453]
[{"$f":"+SOCIOS!A319","v":"h CAP. INTEG."},{"$f":"+SOCIOS!B319","v":0},{"$f":"+SOCIOS!C319","v":0},{"$f":"+SOCIOS!D319","v":"CAPITAL A INTEGRAR (MÍNIMO):"},{"$f":"IF(SOCIOS!E319>0,SOCIOS!E319,\"INCOMPLETO RECHAZAR\")","v":"INCOMPLETO RECHAZAR"},454]
[{"$f":"+SOCIOS!G30","v":"h CAP. INTEG."},{"$f":"+SOCIOS!H30","v":0},{"$f":"+SOCIOS!H30","v":0},{"$f":"+SOCIOS!I30","v":"CAPITAL A INTEGRAR (MÍNIMO):"},{"$f":"IF(SOCIOS!J30>0,SOCIOS!J30,\"INCOMPLETO RECHAZAR\")","v":"INCOMPLETO RECHAZAR"},455]
[{"$f":"+SOCIOS!G47","v":"h CAP. INTEG."},{"$f":"+SOCIOS!H47","v":0},{"$f":"+SOCIOS!H47","v":0},{"$f":"+SOCIOS!I47","v":"CAPITAL A INTEGRAR (MÍNIMO):"},{"$f":"IF(SOCIOS!J47>0,SOCIOS!J47,\"INCOMPLETO RECHAZAR\")","v":"INCOMPLETO RECHAZAR"},456]
[{"$f":"+SOCIOS!G64","v":"h CAP. INTEG."},{"$f":"+SOCIOS!H64","v":0},{"$f":"+SOCIOS!H64","v":0},{"$f":"+SOCIOS!I64","v":"CAPITAL A INTEGRAR (MÍNIMO):"},{"$f":"IF(SOCIOS!J64>0,SOCIOS!J64,\"INCOMPLETO RECHAZAR\")","v":"INCOMPLETO RECHAZAR"},457]
[{"$f":"+SOCIOS!G81","v":"h CAP. INTEG."},{"$f":"+SOCIOS!H81","v":0},{"$f":"+SOCIOS!H81","v":0},{"$f":"+SOCIOS!I81","v":"CAPITAL A INTEGRAR (MÍNIMO):"},{"$f":"IF(SOCIOS!J81>0,SOCIOS!J81,\"INCOMPLETO RECHAZAR\")","v":"INCOMPLETO RECHAZAR"},458]
[{"$f":"+SOCIOS!G98","v":"h CAP. INTEG."},{"$f":"+SOCIOS!H98","v":0},{"$f":"+SOCIOS!H98","v":0},{"$f":"+SOCIOS!I98","v":"CAPITAL A INTEGRAR (MÍNIMO):"},{"$f":"IF(SOCIOS!J98>0,SOCIOS!J98,\"INCOMPLETO RECHAZAR\")","v":"INCOMPLETO RECHAZAR"},459]
[{"$f":"+SOCIOS!G115","v":"h CAP. INTEG."},{"$f":"+SOCIOS!H115","v":0},{"$f":"+SOCIOS!H115","v":0},{"$f":"+SOCIOS!I115","v":"CAPITAL A INTEGRAR (MÍNIMO):"},{"$f":"IF(SOCIOS!J115>0,SOCIOS!J115,\"INCOMPLETO RECHAZAR\")","v":"INCOMPLETO RECHAZAR"},460]
[{"$f":"+SOCIOS!G132","v":"h CAP. INTEG."},{"$f":"+SOCIOS!H132","v":0},{"$f":"+SOCIOS!H132","v":0},{"$f":"+SOCIOS!I132","v":"CAPITAL A INTEGRAR (MÍNIMO):"},{"$f":"IF(SOCIOS!J132>0,SOCIOS!J132,\"INCOMPLETO RECHAZAR\")","v":"INCOMPLETO RECHAZAR"},461]
[{"$f":"+SOCIOS!G149","v":"h CAP. INTEG."},{"$f":"+SOCIOS!H149","v":0},{"$f":"+SOCIOS!H149","v":0},{"$f":"+SOCIOS!I149","v":"CAPITAL A INTEGRAR (MÍNIMO):"},{"$f":"IF(SOCIOS!J149>0,SOCIOS!J149,\"INCOMPLETO RECHAZAR\")","v":"INCOMPLETO RECHAZAR"},462]
[{"$f":"+SOCIOS!G166","v":"h CAP. INTEG."},{"$f":"+SOCIOS!H166","v":0},{"$f":"+SOCIOS!H166","v":0},{"$f":"+SOCIOS!I166","v":"CAPITAL A INTEGRAR (MÍNIMO):"},{"$f":"IF(SOCIOS!J166>0,SOCIOS!J166,\"INCOMPLETO RECHAZAR\")","v":"INCOMPLETO RECHAZAR"},463]
[{"$f":"+SOCIOS!G183","v":"h CAP. INTEG."},{"$f":"+SOCIOS!H183","v":0},{"$f":"+SOCIOS!H183","v":0},{"$f":"+SOCIOS!I183","v":"CAPITAL A INTEGRAR (MÍNIMO):"},{"$f":"IF(SOCIOS!J183>0,SOCIOS!J183,\"INCOMPLETO RECHAZAR\")","v":"INCOMPLETO RECHAZAR"},464]
[{"$f":"+'SOLICITUD-DATOS SOC'!A33","v":"h CAP. INTEG. TOT FORM."},{"$f":"UPPER('SOLICITUD-DATOS SOC'!B33)","v":"0"},{"$f":"UPPER('SOLICITUD-DATOS SOC'!C33)","v":"0"},{"$f":"+'SOLICITUD-DATOS SOC'!D33","v":"CAPITAL MÍNIMO A INTEGRAR TOTAL (SOCIOS DE ESTE FORM):"},{"$f":"IF('SOLICITUD-DATOS SOC'!E33>0,'SOLICITUD-DATOS SOC'!E33,\"INCOMPLETO RECHAZAR\")","v":"INCOMPLETO RECHAZAR"},465]
[{"$f":"+SOCIOS!A35","v":"i ORG. REP. LEGAL/ ADM."},{"$f":"+SOCIOS!B35","v":0},{"$f":"+SOCIOS!C35","v":0},{"$f":"+SOCIOS!D35","v":"NOMBRE CARGO REP. LEGAL/ ADMINISTRACIÓN QUE OCUPA:"},{"$f":"IF(SOCIOS!E35>0,SOCIOS!E35,\"INCOMPLETO RECHAZAR\")","v":"INCOMPLETO RECHAZAR"},466]
[{"$f":"+SOCIOS!A57","v":"i ORG. REP. LEGAL/ ADM."},{"$f":"+SOCIOS!B57","v":0},{"$f":"+SOCIOS!C57","v":0},{"$f":"+SOCIOS!D57","v":"NOMBRE CARGO REP. LEGAL/ ADMINISTRACIÓN QUE OCUPA:"},{"$f":"IF(SOCIOS!E57>0,SOCIOS!E57,\"INCOMPLETO RECHAZAR\")","v":"INCOMPLETO RECHAZAR"},467]
[{"$f":"+SOCIOS!A79","v":"i ORG. REP. LEGAL/ ADM."},{"$f":"+SOCIOS!B79","v":0},{"$f":"+SOCIOS!C79","v":0},{"$f":"+SOCIOS!D79","v":"NOMBRE CARGO REP. LEGAL/ ADMINISTRACIÓN QUE OCUPA:"},{"$f":"IF(SOCIOS!E79>0,SOCIOS!E79,\"INCOMPLETO RECHAZAR\")","v":"INCOMPLETO RECHAZAR"},468]
[{"$f":"+SOCIOS!A101","v":"i ORG. REP. LEGAL/ ADM."},{"$f":"+SOCIOS!B101","v":0},{"$f":"+SOCIOS!C101","v":0},{"$f":"+SOCIOS!D101","v":"NOMBRE CARGO REP. LEGAL/ ADMINISTRACIÓN QUE OCUPA:"},{"$f":"IF(SOCIOS!E101>0,SOCIOS!E101,\"INCOMPLETO RECHAZAR\")","v":"INCOMPLETO RECHAZAR"},469]
[{"$f":"+SOCIOS!A123","v":"i ORG. REP. LEGAL/ ADM."},{"$f":"+SOCIOS!B123","v":0},{"$f":"+SOCIOS!C123","v":0},{"$f":"+SOCIOS!D123","v":"NOMBRE CARGO REP. LEGAL/ ADMINISTRACIÓN QUE OCUPA:"},{"$f":"IF(SOCIOS!E123>0,SOCIOS!E123,\"INCOMPLETO RECHAZAR\")","v":"INCOMPLETO RECHAZAR"},470]
[{"$f":"+SOCIOS!A145","v":"i ORG. REP. LEGAL/ ADM."},{"$f":"+SOCIOS!B145","v":0},{"$f":"+SOCIOS!C145","v":0},{"$f":"+SOCIOS!D145","v":"NOMBRE CARGO REP. LEGAL/ ADMINISTRACIÓN QUE OCUPA:"},{"$f":"IF(SOCIOS!E145>0,SOCIOS!E145,\"INCOMPLETO RECHAZAR\")","v":"INCOMPLETO RECHAZAR"},471]
[{"$f":"+SOCIOS!A167","v":"i ORG. REP. LEGAL/ ADM."},{"$f":"+SOCIOS!B167","v":0},{"$f":"+SOCIOS!C167","v":0},{"$f":"+SOCIOS!D167","v":"NOMBRE CARGO REP. LEGAL/ ADMINISTRACIÓN QUE OCUPA:"},{"$f":"IF(SOCIOS!E167>0,SOCIOS!E167,\"INCOMPLETO RECHAZAR\")","v":"INCOMPLETO RECHAZAR"},472]
[{"$f":"+SOCIOS!A189","v":"i ORG. REP. LEGAL/ ADM."},{"$f":"+SOCIOS!B189","v":0},{"$f":"+SOCIOS!C189","v":0},{"$f":"+SOCIOS!D189","v":"NOMBRE CARGO REP. LEGAL/ ADMINISTRACIÓN QUE OCUPA:"},{"$f":"IF(SOCIOS!E189>0,SOCIOS!E189,\"INCOMPLETO RECHAZAR\")","v":"INCOMPLETO RECHAZAR"},473]
[{"$f":"+SOCIOS!A211","v":"i ORG. REP. LEGAL/ ADM."},{"$f":"+SOCIOS!B211","v":0},{"$f":"+SOCIOS!C211","v":0},{"$f":"+SOCIOS!D211","v":"NOMBRE CARGO REP. LEGAL/ ADMINISTRACIÓN QUE OCUPA:"},{"$f":"IF(SOCIOS!E211>0,SOCIOS!E211,\"INCOMPLETO RECHAZAR\")","v":"INCOMPLETO RECHAZAR"},474]
[{"$f":"+SOCIOS!A233","v":"i ORG. REP. LEGAL/ ADM."},{"$f":"+SOCIOS!B233","v":0},{"$f":"+SOCIOS!C233","v":0},{"$f":"+SOCIOS!D233","v":"NOMBRE CARGO REP. LEGAL/ ADMINISTRACIÓN QUE OCUPA:"},{"$f":"IF(SOCIOS!E233>0,SOCIOS!E233,\"INCOMPLETO RECHAZAR\")","v":"INCOMPLETO RECHAZAR"},475]
[{"$f":"+SOCIOS!A255","v":"i ORG. REP. LEGAL/ ADM."},{"$f":"+SOCIOS!B255","v":0},{"$f":"+SOCIOS!C255","v":0},{"$f":"+SOCIOS!D255","v":"NOMBRE CARGO REP. LEGAL/ ADMINISTRACIÓN QUE OCUPA:"},{"$f":"IF(SOCIOS!E255>0,SOCIOS!E255,\"INCOMPLETO RECHAZAR\")","v":"INCOMPLETO RECHAZAR"},476]
[{"$f":"+SOCIOS!A277","v":"i ORG. REP. LEGAL/ ADM."},{"$f":"+SOCIOS!B277","v":0},{"$f":"+SOCIOS!C277","v":0},{"$f":"+SOCIOS!D277","v":"NOMBRE CARGO REP. LEGAL/ ADMINISTRACIÓN QUE OCUPA:"},{"$f":"IF(SOCIOS!E277>0,SOCIOS!E277,\"INCOMPLETO RECHAZAR\")","v":"INCOMPLETO RECHAZAR"},477]
[{"$f":"+SOCIOS!A299","v":"i ORG. REP. LEGAL/ ADM."},{"$f":"+SOCIOS!B299","v":0},{"$f":"+SOCIOS!C299","v":0},{"$f":"+SOCIOS!D299","v":"NOMBRE CARGO REP. LEGAL/ ADMINISTRACIÓN QUE OCUPA:"},{"$f":"IF(SOCIOS!E299>0,SOCIOS!E299,\"INCOMPLETO RECHAZAR\")","v":"INCOMPLETO RECHAZAR"},478]
[{"$f":"+SOCIOS!A321","v":"i ORG. REP. LEGAL/ ADM."},{"$f":"+SOCIOS!B321","v":0},{"$f":"+SOCIOS!C321","v":0},{"$f":"+SOCIOS!D321","v":"NOMBRE CARGO REP. LEGAL/ ADMINISTRACIÓN QUE OCUPA:"},{"$f":"IF(SOCIOS!E321>0,SOCIOS!E321,\"INCOMPLETO RECHAZAR\")","v":"INCOMPLETO RECHAZAR"},479]
[{"$f":"+'NO SOCIOS'!A21","v":"i ORG. REP. LEGAL/ ADM."},{"$f":"+'NO SOCIOS'!B21","v":0},{"$f":"+'NO SOCIOS'!C21","v":0},{"$f":"+'NO SOCIOS'!D21","v":"NOMBRE CARGO REP. LEGAL/ ADMINISTRACIÓN QUE OCUPA:"},{"$f":"IF('NO SOCIOS'!E21>0,'NO SOCIOS'!E21,\"INCOMPLETO RECHAZAR\")","v":"INCOMPLETO RECHAZAR"},480]
[{"$f":"+'NO SOCIOS'!A37","v":"i ORG. REP. LEGAL/ ADM."},{"$f":"+'NO SOCIOS'!B37","v":0},{"$f":"+'NO SOCIOS'!C37","v":0},{"$f":"+'NO SOCIOS'!D37","v":"NOMBRE CARGO REP. LEGAL/ ADMINISTRACIÓN QUE OCUPA:"},{"$f":"IF('NO SOCIOS'!E37>0,'NO SOCIOS'!E37,\"INCOMPLETO RECHAZAR\")","v":"INCOMPLETO RECHAZAR"},481]
[{"$f":"+'NO SOCIOS'!A53","v":"i ORG. REP. LEGAL/ ADM."},{"$f":"+'NO SOCIOS'!B53","v":0},{"$f":"+'NO SOCIOS'!C53","v":0},{"$f":"+'NO SOCIOS'!D53","v":"NOMBRE CARGO REP. LEGAL/ ADMINISTRACIÓN QUE OCUPA:"},{"$f":"IF('NO SOCIOS'!E53>0,'NO SOCIOS'!E53,\"INCOMPLETO RECHAZAR\")","v":"INCOMPLETO RECHAZAR"},482]
[{"$f":"+'NO SOCIOS'!A69","v":"i ORG. REP. LEGAL/ ADM."},{"$f":"+'NO SOCIOS'!B69","v":0},{"$f":"+'NO SOCIOS'!C69","v":0},{"$f":"+'NO SOCIOS'!D69","v":"NOMBRE CARGO REP. LEGAL/ ADMINISTRACIÓN QUE OCUPA:"},{"$f":"IF('NO SOCIOS'!E69>0,'NO SOCIOS'!E69,\"INCOMPLETO RECHAZAR\")","v":"INCOMPLETO RECHAZAR"},483]
[{"$f":"+'NO SOCIOS'!A85","v":"i ORG. REP. LEGAL/ ADM."},{"$f":"+'NO SOCIOS'!B85","v":0},{"$f":"+'NO SOCIOS'!C85","v":0},{"$f":"+'NO SOCIOS'!D85","v":"NOMBRE CARGO REP. LEGAL/ ADMINISTRACIÓN QUE OCUPA:"},{"$f":"IF('NO SOCIOS'!E85>0,'NO SOCIOS'!E85,\"INCOMPLETO RECHAZAR\")","v":"INCOMPLETO RECHAZAR"},484]
[{"$f":"+'NO SOCIOS'!A101","v":"i ORG. REP. LEGAL/ ADM."},{"$f":"+'NO SOCIOS'!B101","v":0},{"$f":"+'NO SOCIOS'!C101","v":0},{"$f":"+'NO SOCIOS'!D101","v":"NOMBRE CARGO REP. LEGAL/ ADMINISTRACIÓN QUE OCUPA:"},{"$f":"IF('NO SOCIOS'!E101>0,'NO SOCIOS'!E101,\"INCOMPLETO RECHAZAR\")","v":"INCOMPLETO RECHAZAR"},485]
[{"$f":"+'NO SOCIOS'!A117","v":"i ORG. REP. LEGAL/ ADM."},{"$f":"+'NO SOCIOS'!B117","v":0},{"$f":"+'NO SOCIOS'!C117","v":0},{"$f":"+'NO SOCIOS'!D117","v":"NOMBRE CARGO REP. LEGAL/ ADMINISTRACIÓN QUE OCUPA:"},{"$f":"IF('NO SOCIOS'!E117>0,'NO SOCIOS'!E117,\"INCOMPLETO RECHAZAR\")","v":"INCOMPLETO RECHAZAR"},486]
[{"$f":"+'NO SOCIOS'!A133","v":"i ORG. REP. LEGAL/ ADM."},{"$f":"+'NO SOCIOS'!B133","v":0},{"$f":"+'NO SOCIOS'!C133","v":0},{"$f":"+'NO SOCIOS'!D133","v":"NOMBRE CARGO REP. LEGAL/ ADMINISTRACIÓN QUE OCUPA:"},{"$f":"IF('NO SOCIOS'!E133>0,'NO SOCIOS'!E133,\"INCOMPLETO RECHAZAR\")","v":"INCOMPLETO RECHAZAR"},487]
[{"$f":"+'NO SOCIOS'!A149","v":"i ORG. REP. LEGAL/ ADM."},{"$f":"+'NO SOCIOS'!B149","v":0},{"$f":"+'NO SOCIOS'!C149","v":0},{"$f":"+'NO SOCIOS'!D149","v":"NOMBRE CARGO REP. LEGAL/ ADMINISTRACIÓN QUE OCUPA:"},{"$f":"IF('NO SOCIOS'!E149>0,'NO SOCIOS'!E149,\"INCOMPLETO RECHAZAR\")","v":"INCOMPLETO RECHAZAR"},488]
[{"$f":"+'NO SOCIOS'!A165","v":"i ORG. REP. LEGAL/ ADM."},{"$f":"+'NO SOCIOS'!B165","v":0},{"$f":"+'NO SOCIOS'!C165","v":0},{"$f":"+'NO SOCIOS'!D165","v":"NOMBRE CARGO REP. LEGAL/ ADMINISTRACIÓN QUE OCUPA:"},{"$f":"IF('NO SOCIOS'!E165>0,'NO SOCIOS'!E165,\"INCOMPLETO RECHAZAR\")","v":"INCOMPLETO RECHAZAR"},489]
[{"$f":"+'NO SOCIOS'!A181","v":"i ORG. REP. LEGAL/ ADM."},{"$f":"+'NO SOCIOS'!B181","v":0},{"$f":"+'NO SOCIOS'!C181","v":0},{"$f":"+'NO SOCIOS'!D181","v":"NOMBRE CARGO REP. LEGAL/ ADMINISTRACIÓN QUE OCUPA:"},{"$f":"IF('NO SOCIOS'!E181>0,'NO SOCIOS'!E181,\"INCOMPLETO RECHAZAR\")","v":"INCOMPLETO RECHAZAR"},490]
[{"$f":"+'NO SOCIOS'!A197","v":"i ORG. REP. LEGAL/ ADM."},{"$f":"+'NO SOCIOS'!B197","v":0},{"$f":"+'NO SOCIOS'!C197","v":0},{"$f":"+'NO SOCIOS'!D197","v":"NOMBRE CARGO REP. LEGAL/ ADMINISTRACIÓN QUE OCUPA:"},{"$f":"IF('NO SOCIOS'!E197>0,'NO SOCIOS'!E197,\"INCOMPLETO RECHAZAR\")","v":"INCOMPLETO RECHAZAR"},491]
[{"$f":"+'NO SOCIOS'!A213","v":"i ORG. REP. LEGAL/ ADM."},{"$f":"+'NO SOCIOS'!B213","v":0},{"$f":"+'NO SOCIOS'!C213","v":0},{"$f":"+'NO SOCIOS'!D213","v":"NOMBRE CARGO REP. LEGAL/ ADMINISTRACIÓN QUE OCUPA:"},{"$f":"IF('NO SOCIOS'!E213>0,'NO SOCIOS'!E213,\"INCOMPLETO RECHAZAR\")","v":"INCOMPLETO RECHAZAR"},492]
[{"$f":"+'NO SOCIOS'!A229","v":"i ORG. REP. LEGAL/ ADM."},{"$f":"+'NO SOCIOS'!B229","v":0},{"$f":"+'NO SOCIOS'!C229","v":0},{"$f":"+'NO SOCIOS'!D229","v":"NOMBRE CARGO REP. LEGAL/ ADMINISTRACIÓN QUE OCUPA:"},{"$f":"IF('NO SOCIOS'!E229>0,'NO SOCIOS'!E229,\"INCOMPLETO RECHAZAR\")","v":"INCOMPLETO RECHAZAR"},493]
[{"$f":"+'NO SOCIOS'!A245","v":"i ORG. REP. LEGAL/ ADM."},{"$f":"+'NO SOCIOS'!B245","v":0},{"$f":"+'NO SOCIOS'!C245","v":0},{"$f":"+'NO SOCIOS'!D245","v":"NOMBRE CARGO REP. LEGAL/ ADMINISTRACIÓN QUE OCUPA:"},{"$f":"IF('NO SOCIOS'!E245>0,'NO SOCIOS'!E245,\"INCOMPLETO RECHAZAR\")","v":"INCOMPLETO RECHAZAR"},494]
[{"$f":"+SOCIOS!A36","v":"j ORG. FISCALIZ."},{"$f":"+SOCIOS!B36","v":0},{"$f":"+SOCIOS!C36","v":0},{"$f":"+SOCIOS!D36","v":"NOMBRE CARGO FISCALIZACIÓN QUE OCUPA:"},{"$f":"IF(SOCIOS!E36>0,SOCIOS!E36,\"INCOMPLETO RECHAZAR\")","v":"INCOMPLETO RECHAZAR"},495]
[{"$f":"+SOCIOS!A58","v":"j ORG. FISCALIZ."},{"$f":"+SOCIOS!B58","v":0},{"$f":"+SOCIOS!C58","v":0},{"$f":"+SOCIOS!D58","v":"NOMBRE CARGO FISCALIZACIÓN QUE OCUPA:"},{"$f":"IF(SOCIOS!E58>0,SOCIOS!E58,\"INCOMPLETO RECHAZAR\")","v":"INCOMPLETO RECHAZAR"},496]
[{"$f":"+SOCIOS!A80","v":"j ORG. FISCALIZ."},{"$f":"+SOCIOS!B80","v":0},{"$f":"+SOCIOS!C80","v":0},{"$f":"+SOCIOS!D80","v":"NOMBRE CARGO FISCALIZACIÓN QUE OCUPA:"},{"$f":"IF(SOCIOS!E80>0,SOCIOS!E80,\"INCOMPLETO RECHAZAR\")","v":"INCOMPLETO RECHAZAR"},497]
[{"$f":"+SOCIOS!A102","v":"j ORG. FISCALIZ."},{"$f":"+SOCIOS!B102","v":0},{"$f":"+SOCIOS!C102","v":0},{"$f":"+SOCIOS!D102","v":"NOMBRE CARGO FISCALIZACIÓN QUE OCUPA:"},{"$f":"IF(SOCIOS!E102>0,SOCIOS!E102,\"INCOMPLETO RECHAZAR\")","v":"INCOMPLETO RECHAZAR"},498]
[{"$f":"+SOCIOS!A124","v":"j ORG. FISCALIZ."},{"$f":"+SOCIOS!B124","v":0},{"$f":"+SOCIOS!C124","v":0},{"$f":"+SOCIOS!D124","v":"NOMBRE CARGO FISCALIZACIÓN QUE OCUPA:"},{"$f":"IF(SOCIOS!E124>0,SOCIOS!E124,\"INCOMPLETO RECHAZAR\")","v":"INCOMPLETO RECHAZAR"},499]
[{"$f":"+SOCIOS!A146","v":"j ORG. FISCALIZ."},{"$f":"+SOCIOS!B146","v":0},{"$f":"+SOCIOS!C146","v":0},{"$f":"+SOCIOS!D146","v":"NOMBRE CARGO FISCALIZACIÓN QUE OCUPA:"},{"$f":"IF(SOCIOS!E146>0,SOCIOS!E146,\"INCOMPLETO RECHAZAR\")","v":"INCOMPLETO RECHAZAR"},500]
[{"$f":"+SOCIOS!A168","v":"j ORG. FISCALIZ."},{"$f":"+SOCIOS!B168","v":0},{"$f":"+SOCIOS!C168","v":0},{"$f":"+SOCIOS!D168","v":"NOMBRE CARGO FISCALIZACIÓN QUE OCUPA:"},{"$f":"IF(SOCIOS!E168>0,SOCIOS!E168,\"INCOMPLETO RECHAZAR\")","v":"INCOMPLETO RECHAZAR"},501]
[{"$f":"+SOCIOS!A190","v":"j ORG. FISCALIZ."},{"$f":"+SOCIOS!B190","v":0},{"$f":"+SOCIOS!C190","v":0},{"$f":"+SOCIOS!D190","v":"NOMBRE CARGO FISCALIZACIÓN QUE OCUPA:"},{"$f":"IF(SOCIOS!E190>0,SOCIOS!E190,\"INCOMPLETO RECHAZAR\")","v":"INCOMPLETO RECHAZAR"},502]
[{"$f":"+SOCIOS!A212","v":"j ORG. FISCALIZ."},{"$f":"+SOCIOS!B212","v":0},{"$f":"+SOCIOS!C212","v":0},{"$f":"+SOCIOS!D212","v":"NOMBRE CARGO FISCALIZACIÓN QUE OCUPA:"},{"$f":"IF(SOCIOS!E212>0,SOCIOS!E212,\"INCOMPLETO RECHAZAR\")","v":"INCOMPLETO RECHAZAR"},503]
[{"$f":"+SOCIOS!A234","v":"j ORG. FISCALIZ."},{"$f":"+SOCIOS!B234","v":0},{"$f":"+SOCIOS!C234","v":0},{"$f":"+SOCIOS!D234","v":"NOMBRE CARGO FISCALIZACIÓN QUE OCUPA:"},{"$f":"IF(SOCIOS!E234>0,SOCIOS!E234,\"INCOMPLETO RECHAZAR\")","v":"INCOMPLETO RECHAZAR"},504]
[{"$f":"+SOCIOS!A256","v":"j ORG. FISCALIZ."},{"$f":"+SOCIOS!B256","v":0},{"$f":"+SOCIOS!C256","v":0},{"$f":"+SOCIOS!D256","v":"NOMBRE CARGO FISCALIZACIÓN QUE OCUPA:"},{"$f":"IF(SOCIOS!E256>0,SOCIOS!E256,\"INCOMPLETO RECHAZAR\")","v":"INCOMPLETO RECHAZAR"},505]
[{"$f":"+SOCIOS!A278","v":"j ORG. FISCALIZ."},{"$f":"+SOCIOS!B278","v":0},{"$f":"+SOCIOS!C278","v":0},{"$f":"+SOCIOS!D278","v":"NOMBRE CARGO FISCALIZACIÓN QUE OCUPA:"},{"$f":"IF(SOCIOS!E278>0,SOCIOS!E278,\"INCOMPLETO RECHAZAR\")","v":"INCOMPLETO RECHAZAR"},506]
[{"$f":"+SOCIOS!A300","v":"j ORG. FISCALIZ."},{"$f":"+SOCIOS!B300","v":0},{"$f":"+SOCIOS!C300","v":0},{"$f":"+SOCIOS!D300","v":"NOMBRE CARGO FISCALIZACIÓN QUE OCUPA:"},{"$f":"IF(SOCIOS!E300>0,SOCIOS!E300,\"INCOMPLETO RECHAZAR\")","v":"INCOMPLETO RECHAZAR"},507]
[{"$f":"+SOCIOS!A322","v":"j ORG. FISCALIZ."},{"$f":"+SOCIOS!B322","v":0},{"$f":"+SOCIOS!C322","v":0},{"$f":"+SOCIOS!D322","v":"NOMBRE CARGO FISCALIZACIÓN QUE OCUPA:"},{"$f":"IF(SOCIOS!E322>0,SOCIOS!E322,\"INCOMPLETO RECHAZAR\")","v":"INCOMPLETO RECHAZAR"},508]
[{"$f":"+'NO SOCIOS'!A22","v":"j ORG. FISCALIZ."},{"$f":"+'NO SOCIOS'!B22","v":0},{"$f":"+'NO SOCIOS'!C22","v":0},{"$f":"+'NO SOCIOS'!D22","v":"NOMBRE CARGO FISCALIZACIÓN QUE OCUPA:"},{"$f":"IF('NO SOCIOS'!E22>0,'NO SOCIOS'!E22,\"INCOMPLETO RECHAZAR\")","v":"INCOMPLETO RECHAZAR"},509]
[{"$f":"+'NO SOCIOS'!A38","v":"j ORG. FISCALIZ."},{"$f":"+'NO SOCIOS'!B38","v":0},{"$f":"+'NO SOCIOS'!C38","v":0},{"$f":"+'NO SOCIOS'!D38","v":"NOMBRE CARGO FISCALIZACIÓN QUE OCUPA:"},{"$f":"IF('NO SOCIOS'!E38>0,'NO SOCIOS'!E38,\"INCOMPLETO RECHAZAR\")","v":"INCOMPLETO RECHAZAR"},510]
[{"$f":"+'NO SOCIOS'!A54","v":"j ORG. FISCALIZ."},{"$f":"+'NO SOCIOS'!B54","v":0},{"$f":"+'NO SOCIOS'!C54","v":0},{"$f":"+'NO SOCIOS'!D54","v":"NOMBRE CARGO FISCALIZACIÓN QUE OCUPA:"},{"$f":"IF('NO SOCIOS'!E54>0,'NO SOCIOS'!E54,\"INCOMPLETO RECHAZAR\")","v":"INCOMPLETO RECHAZAR"},511]
[{"$f":"+'NO SOCIOS'!A70","v":"j ORG. FISCALIZ."},{"$f":"+'NO SOCIOS'!B70","v":0},{"$f":"+'NO SOCIOS'!C70","v":0},{"$f":"+'NO SOCIOS'!D70","v":"NOMBRE CARGO FISCALIZACIÓN QUE OCUPA:"},{"$f":"IF('NO SOCIOS'!E70>0,'NO SOCIOS'!E70,\"INCOMPLETO RECHAZAR\")","v":"INCOMPLETO RECHAZAR"},512]
[{"$f":"+'NO SOCIOS'!A86","v":"j ORG. FISCALIZ."},{"$f":"+'NO SOCIOS'!B86","v":0},{"$f":"+'NO SOCIOS'!C86","v":0},{"$f":"+'NO SOCIOS'!D86","v":"NOMBRE CARGO FISCALIZACIÓN QUE OCUPA:"},{"$f":"IF('NO SOCIOS'!E86>0,'NO SOCIOS'!E86,\"INCOMPLETO RECHAZAR\")","v":"INCOMPLETO RECHAZAR"},513]
[{"$f":"+'NO SOCIOS'!A102","v":"j ORG. FISCALIZ."},{"$f":"+'NO SOCIOS'!B102","v":0},{"$f":"+'NO SOCIOS'!C102","v":0},{"$f":"+'NO SOCIOS'!D102","v":"NOMBRE CARGO FISCALIZACIÓN QUE OCUPA:"},{"$f":"IF('NO SOCIOS'!E102>0,'NO SOCIOS'!E102,\"INCOMPLETO RECHAZAR\")","v":"INCOMPLETO RECHAZAR"},514]
[{"$f":"+'NO SOCIOS'!A118","v":"j ORG. FISCALIZ."},{"$f":"+'NO SOCIOS'!B118","v":0},{"$f":"+'NO SOCIOS'!C118","v":0},{"$f":"+'NO SOCIOS'!D118","v":"NOMBRE CARGO FISCALIZACIÓN QUE OCUPA:"},{"$f":"IF('NO SOCIOS'!E118>0,'NO SOCIOS'!E118,\"INCOMPLETO RECHAZAR\")","v":"INCOMPLETO RECHAZAR"},515]
[{"$f":"+'NO SOCIOS'!A134","v":"j ORG. FISCALIZ."},{"$f":"+'NO SOCIOS'!B134","v":0},{"$f":"+'NO SOCIOS'!C134","v":0},{"$f":"+'NO SOCIOS'!D134","v":"NOMBRE CARGO FISCALIZACIÓN QUE OCUPA:"},{"$f":"IF('NO SOCIOS'!E134>0,'NO SOCIOS'!E134,\"INCOMPLETO RECHAZAR\")","v":"INCOMPLETO RECHAZAR"},516]
[{"$f":"+'NO SOCIOS'!A150","v":"j ORG. FISCALIZ."},{"$f":"+'NO SOCIOS'!B150","v":0},{"$f":"+'NO SOCIOS'!C150","v":0},{"$f":"+'NO SOCIOS'!D150","v":"NOMBRE CARGO FISCALIZACIÓN QUE OCUPA:"},{"$f":"IF('NO SOCIOS'!E150>0,'NO SOCIOS'!E150,\"INCOMPLETO RECHAZAR\")","v":"INCOMPLETO RECHAZAR"},517]
[{"$f":"+'NO SOCIOS'!A166","v":"j ORG. FISCALIZ."},{"$f":"+'NO SOCIOS'!B166","v":0},{"$f":"+'NO SOCIOS'!C166","v":0},{"$f":"+'NO SOCIOS'!D166","v":"NOMBRE CARGO FISCALIZACIÓN QUE OCUPA:"},{"$f":"IF('NO SOCIOS'!E166>0,'NO SOCIOS'!E166,\"INCOMPLETO RECHAZAR\")","v":"INCOMPLETO RECHAZAR"},518]
[{"$f":"+'NO SOCIOS'!A182","v":"j ORG. FISCALIZ."},{"$f":"+'NO SOCIOS'!B182","v":0},{"$f":"+'NO SOCIOS'!C182","v":0},{"$f":"+'NO SOCIOS'!D182","v":"NOMBRE CARGO FISCALIZACIÓN QUE OCUPA:"},{"$f":"IF('NO SOCIOS'!E182>0,'NO SOCIOS'!E182,\"INCOMPLETO RECHAZAR\")","v":"INCOMPLETO RECHAZAR"},519]
[{"$f":"+'NO SOCIOS'!A198","v":"j ORG. FISCALIZ."},{"$f":"+'NO SOCIOS'!B198","v":0},{"$f":"+'NO SOCIOS'!C198","v":0},{"$f":"+'NO SOCIOS'!D198","v":"NOMBRE CARGO FISCALIZACIÓN QUE OCUPA:"},{"$f":"IF('NO SOCIOS'!E198>0,'NO SOCIOS'!E198,\"INCOMPLETO RECHAZAR\")","v":"INCOMPLETO RECHAZAR"},520]
[{"$f":"+'NO SOCIOS'!A214","v":"j ORG. FISCALIZ."},{"$f":"+'NO SOCIOS'!B214","v":0},{"$f":"+'NO SOCIOS'!C214","v":0},{"$f":"+'NO SOCIOS'!D214","v":"NOMBRE CARGO FISCALIZACIÓN QUE OCUPA:"},{"$f":"IF('NO SOCIOS'!E214>0,'NO SOCIOS'!E214,\"INCOMPLETO RECHAZAR\")","v":"INCOMPLETO RECHAZAR"},521]
[{"$f":"+'NO SOCIOS'!A230","v":"j ORG. FISCALIZ."},{"$f":"+'NO SOCIOS'!B230","v":0},{"$f":"+'NO SOCIOS'!C230","v":0},{"$f":"+'NO SOCIOS'!D230","v":"NOMBRE CARGO FISCALIZACIÓN QUE OCUPA:"},{"$f":"IF('NO SOCIOS'!E230>0,'NO SOCIOS'!E230,\"INCOMPLETO RECHAZAR\")","v":"INCOMPLETO RECHAZAR"},522]
[{"$f":"+'NO SOCIOS'!A246","v":"j ORG. FISCALIZ."},{"$f":"+'NO SOCIOS'!B246","v":0},{"$f":"+'NO SOCIOS'!C246","v":0},{"$f":"+'NO SOCIOS'!D246","v":"NOMBRE CARGO FISCALIZACIÓN QUE OCUPA:"},{"$f":"IF('NO SOCIOS'!E246>0,'NO SOCIOS'!E246,\"INCOMPLETO RECHAZAR\")","v":"INCOMPLETO RECHAZAR"},523]
[{"$f":"+'NO SOCIOS'!A16","v":"l NO SOCIO"},{"$f":"+'NO SOCIOS'!B16","v":0},{"$f":"+'NO SOCIOS'!C16","v":0},{"$f":"+'NO SOCIOS'!D16","v":"EMAIL:"},{"$f":"IF('NO SOCIOS'!E16>0,'NO SOCIOS'!E16,\"INCOMPLETO RECHAZAR\")","v":"INCOMPLETO RECHAZAR"},524]
[{"$f":"+'NO SOCIOS'!A32","v":"l NO SOCIO"},{"$f":"+'NO SOCIOS'!B32","v":0},{"$f":"+'NO SOCIOS'!C32","v":0},{"$f":"+'NO SOCIOS'!D32","v":"EMAIL:"},{"$f":"IF('NO SOCIOS'!E32>0,'NO SOCIOS'!E32,\"INCOMPLETO RECHAZAR\")","v":"INCOMPLETO RECHAZAR"},525]
[{"$f":"+'NO SOCIOS'!A48","v":"l NO SOCIO"},{"$f":"+'NO SOCIOS'!B48","v":0},{"$f":"+'NO SOCIOS'!C48","v":0},{"$f":"+'NO SOCIOS'!D48","v":"EMAIL:"},{"$f":"IF('NO SOCIOS'!E48>0,'NO SOCIOS'!E48,\"INCOMPLETO RECHAZAR\")","v":"INCOMPLETO RECHAZAR"},526]
[{"$f":"+'NO SOCIOS'!A64","v":"l NO SOCIO"},{"$f":"+'NO SOCIOS'!B64","v":0},{"$f":"+'NO SOCIOS'!C64","v":0},{"$f":"+'NO SOCIOS'!D64","v":"EMAIL:"},{"$f":"IF('NO SOCIOS'!E64>0,'NO SOCIOS'!E64,\"INCOMPLETO RECHAZAR\")","v":"INCOMPLETO RECHAZAR"},527]
[{"$f":"+'NO SOCIOS'!A80","v":"l NO SOCIO"},{"$f":"+'NO SOCIOS'!B80","v":0},{"$f":"+'NO SOCIOS'!C80","v":0},{"$f":"+'NO SOCIOS'!D80","v":"EMAIL:"},{"$f":"IF('NO SOCIOS'!E80>0,'NO SOCIOS'!E80,\"INCOMPLETO RECHAZAR\")","v":"INCOMPLETO RECHAZAR"},528]
[{"$f":"+'NO SOCIOS'!A96","v":"l NO SOCIO"},{"$f":"+'NO SOCIOS'!B96","v":0},{"$f":"+'NO SOCIOS'!C96","v":0},{"$f":"+'NO SOCIOS'!D96","v":"EMAIL:"},{"$f":"IF('NO SOCIOS'!E96>0,'NO SOCIOS'!E96,\"INCOMPLETO RECHAZAR\")","v":"INCOMPLETO RECHAZAR"},529]
[{"$f":"+'NO SOCIOS'!A112","v":"l NO SOCIO"},{"$f":"+'NO SOCIOS'!B112","v":0},{"$f":"+'NO SOCIOS'!C112","v":0},{"$f":"+'NO SOCIOS'!D112","v":"EMAIL:"},{"$f":"IF('NO SOCIOS'!E112>0,'NO SOCIOS'!E112,\"INCOMPLETO RECHAZAR\")","v":"INCOMPLETO RECHAZAR"},530]
[{"$f":"+'NO SOCIOS'!A128","v":"l NO SOCIO"},{"$f":"+'NO SOCIOS'!B128","v":0},{"$f":"+'NO SOCIOS'!C128","v":0},{"$f":"+'NO SOCIOS'!D128","v":"EMAIL:"},{"$f":"IF('NO SOCIOS'!E128>0,'NO SOCIOS'!E128,\"INCOMPLETO RECHAZAR\")","v":"INCOMPLETO RECHAZAR"},531]
[{"$f":"+'NO SOCIOS'!A144","v":"l NO SOCIO"},{"$f":"+'NO SOCIOS'!B144","v":0},{"$f":"+'NO SOCIOS'!C144","v":0},{"$f":"+'NO SOCIOS'!D144","v":"EMAIL:"},{"$f":"IF('NO SOCIOS'!E144>0,'NO SOCIOS'!E144,\"INCOMPLETO RECHAZAR\")","v":"INCOMPLETO RECHAZAR"},532]
[{"$f":"+'NO SOCIOS'!A160","v":"l NO SOCIO"},{"$f":"+'NO SOCIOS'!B160","v":0},{"$f":"+'NO SOCIOS'!C160","v":0},{"$f":"+'NO SOCIOS'!D160","v":"EMAIL:"},{"$f":"IF('NO SOCIOS'!E160>0,'NO SOCIOS'!E160,\"INCOMPLETO RECHAZAR\")","v":"INCOMPLETO RECHAZAR"},533]
[{"$f":"+'NO SOCIOS'!A176","v":"l NO SOCIO"},{"$f":"+'NO SOCIOS'!B176","v":0},{"$f":"+'NO SOCIOS'!C176","v":0},{"$f":"+'NO SOCIOS'!D176","v":"EMAIL:"},{"$f":"IF('NO SOCIOS'!E176>0,'NO SOCIOS'!E176,\"INCOMPLETO RECHAZAR\")","v":"INCOMPLETO RECHAZAR"},534]
[{"$f":"+'NO SOCIOS'!A192","v":"l NO SOCIO"},{"$f":"+'NO SOCIOS'!B192","v":0},{"$f":"+'NO SOCIOS'!C192","v":0},{"$f":"+'NO SOCIOS'!D192","v":"EMAIL:"},{"$f":"IF('NO SOCIOS'!E192>0,'NO SOCIOS'!E192,\"INCOMPLETO RECHAZAR\")","v":"INCOMPLETO RECHAZAR"},535]
[{"$f":"+'NO SOCIOS'!A208","v":"l NO SOCIO"},{"$f":"+'NO SOCIOS'!B208","v":0},{"$f":"+'NO SOCIOS'!C208","v":0},{"$f":"+'NO SOCIOS'!D208","v":"EMAIL:"},{"$f":"IF('NO SOCIOS'!E208>0,'NO SOCIOS'!E208,\"INCOMPLETO RECHAZAR\")","v":"INCOMPLETO RECHAZAR"},536]
[{"$f":"+'NO SOCIOS'!A224","v":"l NO SOCIO"},{"$f":"+'NO SOCIOS'!B224","v":0},{"$f":"+'NO SOCIOS'!C224","v":0},{"$f":"+'NO SOCIOS'!D224","v":"EMAIL:"},{"$f":"IF('NO SOCIOS'!E224>0,'NO SOCIOS'!E224,\"INCOMPLETO RECHAZAR\")","v":"INCOMPLETO RECHAZAR"},537]
[{"$f":"+'NO SOCIOS'!A240","v":"l NO SOCIO"},{"$f":"+'NO SOCIOS'!B240","v":0},{"$f":"+'NO SOCIOS'!C240","v":0},{"$f":"+'NO SOCIOS'!D240","v":"EMAIL:"},{"$f":"IF('NO SOCIOS'!E240>0,'NO SOCIOS'!E240,\"INCOMPLETO RECHAZAR\")","v":"INCOMPLETO RECHAZAR"},538]
[{"$f":"+'NO SOCIOS'!A18","v":"l NO SOCIO"},{"$f":"+'NO SOCIOS'!B18","v":0},{"$f":"+'NO SOCIOS'!C18","v":0},{"$f":"+'NO SOCIOS'!D18","v":""},{"$f":"IF('NO SOCIOS'!E18>0,'NO SOCIOS'!E18,\"INCOMPLETO RECHAZAR\")","v":"INCOMPLETO RECHAZAR"},539]
[{"$f":"+'NO SOCIOS'!A15","v":"l NO SOCIO"},{"$f":"+'NO SOCIOS'!B15","v":0},{"$f":"+'NO SOCIOS'!C15","v":0},{"$f":"+'NO SOCIOS'!D15","v":"CEL/TEL :"},{"$f":"IF('NO SOCIOS'!E15>0,'NO SOCIOS'!E15,\"INCOMPLETO RECHAZAR\")","v":"INCOMPLETO RECHAZAR"},540]
[{"$f":"+'NO SOCIOS'!A9","v":"l NO SOCIO"},{"$f":"+'NO SOCIOS'!B9","v":0},{"$f":"+'NO SOCIOS'!C9","v":0},{"$f":"+'NO SOCIOS'!D9","v":"CUIT/CUIL –sin puntos ni barras-:"},{"$f":"IF('NO SOCIOS'!E9>0,'NO SOCIOS'!E9,\"INCOMPLETO RECHAZAR\")","v":"INCOMPLETO RECHAZAR"},541]
[{"$f":"+'NO SOCIOS'!A20","v":"l NO SOCIO"},{"$f":"+'NO SOCIOS'!B20","v":0},{"$f":"+'NO SOCIOS'!C20","v":0},{"$f":"+'NO SOCIOS'!D20","v":""},{"$f":"IF('NO SOCIOS'!E20>0,'NO SOCIOS'!E20,\"INCOMPLETO RECHAZAR\")","v":"INCOMPLETO RECHAZAR"},542]
[{"$f":"+'NO SOCIOS'!A8","v":"l NO SOCIO"},{"$f":"+'NO SOCIOS'!B8","v":0},{"$f":"+'NO SOCIOS'!C8","v":0},{"$f":"+'NO SOCIOS'!D8","v":"DOC. IDENTIDAD –sin puntos-:"},{"$f":"IF('NO SOCIOS'!E8>0,'NO SOCIOS'!E8,\"INCOMPLETO RECHAZAR\")","v":"INCOMPLETO RECHAZAR"},543]
[{"$f":"+'NO SOCIOS'!A14","v":"l NO SOCIO"},{"$f":"+'NO SOCIOS'!B14","v":0},{"$f":"+'NO SOCIOS'!C14","v":0},{"$f":"+'NO SOCIOS'!D14","v":"DOMICILIO REAL:"},{"$f":"IF('NO SOCIOS'!E14>0,'NO SOCIOS'!E14,\"INCOMPLETO RECHAZAR\")","v":"INCOMPLETO RECHAZAR"},544]
[{"$f":"+'NO SOCIOS'!A17","v":"l NO SOCIO"},{"$f":"+'NO SOCIOS'!B17","v":0},{"$f":"+'NO SOCIOS'!C17","v":0},{"$f":"+'NO SOCIOS'!D17","v":"ESTADO CIVIL:"},{"$f":"IF('NO SOCIOS'!E17>0,'NO SOCIOS'!E17,\"INCOMPLETO RECHAZAR\")","v":"INCOMPLETO RECHAZAR"},545]
[{"$f":"+'NO SOCIOS'!A10","v":"l NO SOCIO"},{"$f":"+'NO SOCIOS'!B10","v":0},{"$f":"+'NO SOCIOS'!C10","v":0},{"$f":"+'NO SOCIOS'!D10","v":"FECHA DE NACIMIENTO –dd/mm/aa-:"},{"$f":"IF('NO SOCIOS'!E10>0,'NO SOCIOS'!E10,\"INCOMPLETO RECHAZAR\")","v":"INCOMPLETO RECHAZAR"},546]
[{"$f":"+'NO SOCIOS'!A11","v":"l NO SOCIO"},{"$f":"+'NO SOCIOS'!B11","v":0},{"$f":"+'NO SOCIOS'!C11","v":0},{"$f":"+'NO SOCIOS'!D11","v":"LUGAR DE NACIMIENTO:"},{"$f":"IF('NO SOCIOS'!E11>0,'NO SOCIOS'!E11,\"INCOMPLETO RECHAZAR\")","v":"INCOMPLETO RECHAZAR"},547]
[{"$f":"+'NO SOCIOS'!A12","v":"l NO SOCIO"},{"$f":"+'NO SOCIOS'!B12","v":0},{"$f":"+'NO SOCIOS'!C12","v":0},{"$f":"+'NO SOCIOS'!D12","v":"NACIONALIDAD:"},{"$f":"IF('NO SOCIOS'!E12>0,'NO SOCIOS'!E12,\"INCOMPLETO RECHAZAR\")","v":"INCOMPLETO RECHAZAR"},548]
[{"$f":"+'NO SOCIOS'!A19","v":"l NO SOCIO"},{"$f":"+'NO SOCIOS'!B19","v":0},{"$f":"+'NO SOCIOS'!C19","v":0},{"$f":"+'NO SOCIOS'!D19","v":""},{"$f":"IF('NO SOCIOS'!E19>0,'NO SOCIOS'!E19,\"INCOMPLETO RECHAZAR\")","v":"INCOMPLETO RECHAZAR"},549]
[{"$f":"+'NO SOCIOS'!A23","v":"l NO SOCIO"},{"$f":"+'NO SOCIOS'!B23","v":0},{"$f":"+'NO SOCIOS'!C23","v":0},{"$f":"+'NO SOCIOS'!D23","v":"NOTA/OBSERVACIÓN -en mayúscula-:"},{"$f":"IF('NO SOCIOS'!E23>0,'NO SOCIOS'!E23,\"INCOMPLETO RECHAZAR\")","v":"INCOMPLETO RECHAZAR"},550]
[{"$f":"+'NO SOCIOS'!A13","v":"l NO SOCIO"},{"$f":"+'NO SOCIOS'!B13","v":0},{"$f":"+'NO SOCIOS'!C13","v":0},{"$f":"+'NO SOCIOS'!D13","v":"PROFESIÓN/OFICIO:"},{"$f":"IF('NO SOCIOS'!E13>0,'NO SOCIOS'!E13,\"INCOMPLETO RECHAZAR\")","v":"INCOMPLETO RECHAZAR"},551]
[{"$f":"+'NO SOCIOS'!A34","v":"l NO SOCIO"},{"$f":"+'NO SOCIOS'!B34","v":0},{"$f":"+'NO SOCIOS'!C34","v":0},{"$f":"+'NO SOCIOS'!D34","v":""},{"$f":"IF('NO SOCIOS'!E34>0,'NO SOCIOS'!E34,\"INCOMPLETO RECHAZAR\")","v":"INCOMPLETO RECHAZAR"},552]
[{"$f":"+'NO SOCIOS'!A31","v":"l NO SOCIO"},{"$f":"+'NO SOCIOS'!B31","v":0},{"$f":"+'NO SOCIOS'!C31","v":0},{"$f":"+'NO SOCIOS'!D31","v":"CEL/TEL :"},{"$f":"IF('NO SOCIOS'!E31>0,'NO SOCIOS'!E31,\"INCOMPLETO RECHAZAR\")","v":"INCOMPLETO RECHAZAR"},553]
[{"$f":"+'NO SOCIOS'!A25","v":"l NO SOCIO"},{"$f":"+'NO SOCIOS'!B25","v":0},{"$f":"+'NO SOCIOS'!C25","v":0},{"$f":"+'NO SOCIOS'!D25","v":"CUIT/CUIL –sin puntos ni barras-:"},{"$f":"IF('NO SOCIOS'!E25>0,'NO SOCIOS'!E25,\"INCOMPLETO RECHAZAR\")","v":"INCOMPLETO RECHAZAR"},554]
[{"$f":"+'NO SOCIOS'!A36","v":"l NO SOCIO"},{"$f":"+'NO SOCIOS'!B36","v":0},{"$f":"+'NO SOCIOS'!C36","v":0},{"$f":"+'NO SOCIOS'!D36","v":""},{"$f":"IF('NO SOCIOS'!E36>0,'NO SOCIOS'!E36,\"INCOMPLETO RECHAZAR\")","v":"INCOMPLETO RECHAZAR"},555]
[{"$f":"+'NO SOCIOS'!A24","v":"l NO SOCIO"},{"$f":"+'NO SOCIOS'!B24","v":0},{"$f":"+'NO SOCIOS'!C24","v":0},{"$f":"+'NO SOCIOS'!D24","v":"DOC. IDENTIDAD –sin puntos-:"},{"$f":"IF('NO SOCIOS'!E24>0,'NO SOCIOS'!E24,\"INCOMPLETO RECHAZAR\")","v":"INCOMPLETO RECHAZAR"},556]
[{"$f":"+'NO SOCIOS'!A30","v":"l NO SOCIO"},{"$f":"+'NO SOCIOS'!B30","v":0},{"$f":"+'NO SOCIOS'!C30","v":0},{"$f":"+'NO SOCIOS'!D30","v":"DOMICILIO REAL:"},{"$f":"IF('NO SOCIOS'!E30>0,'NO SOCIOS'!E30,\"INCOMPLETO RECHAZAR\")","v":"INCOMPLETO RECHAZAR"},557]
[{"$f":"+'NO SOCIOS'!A33","v":"l NO SOCIO"},{"$f":"+'NO SOCIOS'!B33","v":0},{"$f":"+'NO SOCIOS'!C33","v":0},{"$f":"+'NO SOCIOS'!D33","v":"ESTADO CIVIL:"},{"$f":"IF('NO SOCIOS'!E33>0,'NO SOCIOS'!E33,\"INCOMPLETO RECHAZAR\")","v":"INCOMPLETO RECHAZAR"},558]
[{"$f":"+'NO SOCIOS'!A26","v":"l NO SOCIO"},{"$f":"+'NO SOCIOS'!B26","v":0},{"$f":"+'NO SOCIOS'!C26","v":0},{"$f":"+'NO SOCIOS'!D26","v":"FECHA DE NACIMIENTO –dd/mm/aa-:"},{"$f":"IF('NO SOCIOS'!E26>0,'NO SOCIOS'!E26,\"INCOMPLETO RECHAZAR\")","v":"INCOMPLETO RECHAZAR"},559]
[{"$f":"+'NO SOCIOS'!A27","v":"l NO SOCIO"},{"$f":"+'NO SOCIOS'!B27","v":0},{"$f":"+'NO SOCIOS'!C27","v":0},{"$f":"+'NO SOCIOS'!D27","v":"LUGAR DE NACIMIENTO:"},{"$f":"IF('NO SOCIOS'!E27>0,'NO SOCIOS'!E27,\"INCOMPLETO RECHAZAR\")","v":"INCOMPLETO RECHAZAR"},560]
[{"$f":"+'NO SOCIOS'!A28","v":"l NO SOCIO"},{"$f":"+'NO SOCIOS'!B28","v":0},{"$f":"+'NO SOCIOS'!C28","v":0},{"$f":"+'NO SOCIOS'!D28","v":"NACIONALIDAD:"},{"$f":"IF('NO SOCIOS'!E28>0,'NO SOCIOS'!E28,\"INCOMPLETO RECHAZAR\")","v":"INCOMPLETO RECHAZAR"},561]
[{"$f":"+'NO SOCIOS'!A35","v":"l NO SOCIO"},{"$f":"+'NO SOCIOS'!B35","v":0},{"$f":"+'NO SOCIOS'!C35","v":0},{"$f":"+'NO SOCIOS'!D35","v":""},{"$f":"IF('NO SOCIOS'!E35>0,'NO SOCIOS'!E35,\"INCOMPLETO RECHAZAR\")","v":"INCOMPLETO RECHAZAR"},562]
[{"$f":"+'NO SOCIOS'!A39","v":"l NO SOCIO"},{"$f":"+'NO SOCIOS'!B39","v":0},{"$f":"+'NO SOCIOS'!C39","v":0},{"$f":"+'NO SOCIOS'!D39","v":"NOTA/OBSERVACIÓN -en mayúscula-:"},{"$f":"IF('NO SOCIOS'!E39>0,'NO SOCIOS'!E39,\"INCOMPLETO RECHAZAR\")","v":"INCOMPLETO RECHAZAR"},563]
[{"$f":"+'NO SOCIOS'!A29","v":"l NO SOCIO"},{"$f":"+'NO SOCIOS'!B29","v":0},{"$f":"+'NO SOCIOS'!C29","v":0},{"$f":"+'NO SOCIOS'!D29","v":"PROFESIÓN/OFICIO:"},{"$f":"IF('NO SOCIOS'!E29>0,'NO SOCIOS'!E29,\"INCOMPLETO RECHAZAR\")","v":"INCOMPLETO RECHAZAR"},564]
[{"$f":"+'NO SOCIOS'!A50","v":"l NO SOCIO"},{"$f":"+'NO SOCIOS'!B50","v":0},{"$f":"+'NO SOCIOS'!C50","v":0},{"$f":"+'NO SOCIOS'!D50","v":""},{"$f":"IF('NO SOCIOS'!E50>0,'NO SOCIOS'!E50,\"INCOMPLETO RECHAZAR\")","v":"INCOMPLETO RECHAZAR"},565]
[{"$f":"+'NO SOCIOS'!A47","v":"l NO SOCIO"},{"$f":"+'NO SOCIOS'!B47","v":0},{"$f":"+'NO SOCIOS'!C47","v":0},{"$f":"+'NO SOCIOS'!D47","v":"CEL/TEL :"},{"$f":"IF('NO SOCIOS'!E47>0,'NO SOCIOS'!E47,\"INCOMPLETO RECHAZAR\")","v":"INCOMPLETO RECHAZAR"},566]
[{"$f":"+'NO SOCIOS'!A41","v":"l NO SOCIO"},{"$f":"+'NO SOCIOS'!B41","v":0},{"$f":"+'NO SOCIOS'!C41","v":0},{"$f":"+'NO SOCIOS'!D41","v":"CUIT/CUIL –sin puntos ni barras-:"},{"$f":"IF('NO SOCIOS'!E41>0,'NO SOCIOS'!E41,\"INCOMPLETO RECHAZAR\")","v":"INCOMPLETO RECHAZAR"},567]
[{"$f":"+'NO SOCIOS'!A52","v":"l NO SOCIO"},{"$f":"+'NO SOCIOS'!B52","v":0},{"$f":"+'NO SOCIOS'!C52","v":0},{"$f":"+'NO SOCIOS'!D52","v":""},{"$f":"IF('NO SOCIOS'!E52>0,'NO SOCIOS'!E52,\"INCOMPLETO RECHAZAR\")","v":"INCOMPLETO RECHAZAR"},568]
[{"$f":"+'NO SOCIOS'!A40","v":"l NO SOCIO"},{"$f":"+'NO SOCIOS'!B40","v":0},{"$f":"+'NO SOCIOS'!C40","v":0},{"$f":"+'NO SOCIOS'!D40","v":"DOC. IDENTIDAD –sin puntos-:"},{"$f":"IF('NO SOCIOS'!E40>0,'NO SOCIOS'!E40,\"INCOMPLETO RECHAZAR\")","v":"INCOMPLETO RECHAZAR"},569]
[{"$f":"+'NO SOCIOS'!A46","v":"l NO SOCIO"},{"$f":"+'NO SOCIOS'!B46","v":0},{"$f":"+'NO SOCIOS'!C46","v":0},{"$f":"+'NO SOCIOS'!D46","v":"DOMICILIO REAL:"},{"$f":"IF('NO SOCIOS'!E46>0,'NO SOCIOS'!E46,\"INCOMPLETO RECHAZAR\")","v":"INCOMPLETO RECHAZAR"},570]
[{"$f":"+'NO SOCIOS'!A49","v":"l NO SOCIO"},{"$f":"+'NO SOCIOS'!B49","v":0},{"$f":"+'NO SOCIOS'!C49","v":0},{"$f":"+'NO SOCIOS'!D49","v":"ESTADO CIVIL:"},{"$f":"IF('NO SOCIOS'!E49>0,'NO SOCIOS'!E49,\"INCOMPLETO RECHAZAR\")","v":"INCOMPLETO RECHAZAR"},571]
[{"$f":"+'NO SOCIOS'!A42","v":"l NO SOCIO"},{"$f":"+'NO SOCIOS'!B42","v":0},{"$f":"+'NO SOCIOS'!C42","v":0},{"$f":"+'NO SOCIOS'!D42","v":"FECHA DE NACIMIENTO –dd/mm/aa-:"},{"$f":"IF('NO SOCIOS'!E42>0,'NO SOCIOS'!E42,\"INCOMPLETO RECHAZAR\")","v":"INCOMPLETO RECHAZAR"},572]
[{"$f":"+'NO SOCIOS'!A43","v":"l NO SOCIO"},{"$f":"+'NO SOCIOS'!B43","v":0},{"$f":"+'NO SOCIOS'!C43","v":0},{"$f":"+'NO SOCIOS'!D43","v":"LUGAR DE NACIMIENTO:"},{"$f":"IF('NO SOCIOS'!E43>0,'NO SOCIOS'!E43,\"INCOMPLETO RECHAZAR\")","v":"INCOMPLETO RECHAZAR"},573]
[{"$f":"+'NO SOCIOS'!A44","v":"l NO SOCIO"},{"$f":"+'NO SOCIOS'!B44","v":0},{"$f":"+'NO SOCIOS'!C44","v":0},{"$f":"+'NO SOCIOS'!D44","v":"NACIONALIDAD:"},{"$f":"IF('NO SOCIOS'!E44>0,'NO SOCIOS'!E44,\"INCOMPLETO RECHAZAR\")","v":"INCOMPLETO RECHAZAR"},574]
[{"$f":"+'NO SOCIOS'!A51","v":"l NO SOCIO"},{"$f":"+'NO SOCIOS'!B51","v":0},{"$f":"+'NO SOCIOS'!C51","v":0},{"$f":"+'NO SOCIOS'!D51","v":""},{"$f":"IF('NO SOCIOS'!E51>0,'NO SOCIOS'!E51,\"INCOMPLETO RECHAZAR\")","v":"INCOMPLETO RECHAZAR"},575]
[{"$f":"+'NO SOCIOS'!A55","v":"l NO SOCIO"},{"$f":"+'NO SOCIOS'!B55","v":0},{"$f":"+'NO SOCIOS'!C55","v":0},{"$f":"+'NO SOCIOS'!D55","v":"NOTA/OBSERVACIÓN -en mayúscula-:"},{"$f":"IF('NO SOCIOS'!E55>0,'NO SOCIOS'!E55,\"INCOMPLETO RECHAZAR\")","v":"INCOMPLETO RECHAZAR"},576]
[{"$f":"+'NO SOCIOS'!A45","v":"l NO SOCIO"},{"$f":"+'NO SOCIOS'!B45","v":0},{"$f":"+'NO SOCIOS'!C45","v":0},{"$f":"+'NO SOCIOS'!D45","v":"PROFESIÓN/OFICIO:"},{"$f":"IF('NO SOCIOS'!E45>0,'NO SOCIOS'!E45,\"INCOMPLETO RECHAZAR\")","v":"INCOMPLETO RECHAZAR"},577]
[{"$f":"+'NO SOCIOS'!A66","v":"l NO SOCIO"},{"$f":"+'NO SOCIOS'!B66","v":0},{"$f":"+'NO SOCIOS'!C66","v":0},{"$f":"+'NO SOCIOS'!D66","v":""},{"$f":"IF('NO SOCIOS'!E66>0,'NO SOCIOS'!E66,\"INCOMPLETO RECHAZAR\")","v":"INCOMPLETO RECHAZAR"},578]
[{"$f":"+'NO SOCIOS'!A63","v":"l NO SOCIO"},{"$f":"+'NO SOCIOS'!B63","v":0},{"$f":"+'NO SOCIOS'!C63","v":0},{"$f":"+'NO SOCIOS'!D63","v":"CEL/TEL :"},{"$f":"IF('NO SOCIOS'!E63>0,'NO SOCIOS'!E63,\"INCOMPLETO RECHAZAR\")","v":"INCOMPLETO RECHAZAR"},579]
[{"$f":"+'NO SOCIOS'!A57","v":"l NO SOCIO"},{"$f":"+'NO SOCIOS'!B57","v":0},{"$f":"+'NO SOCIOS'!C57","v":0},{"$f":"+'NO SOCIOS'!D57","v":"CUIT/CUIL –sin puntos ni barras-:"},{"$f":"IF('NO SOCIOS'!E57>0,'NO SOCIOS'!E57,\"INCOMPLETO RECHAZAR\")","v":"INCOMPLETO RECHAZAR"},580]
[{"$f":"+'NO SOCIOS'!A68","v":"l NO SOCIO"},{"$f":"+'NO SOCIOS'!B68","v":0},{"$f":"+'NO SOCIOS'!C68","v":0},{"$f":"+'NO SOCIOS'!D68","v":""},{"$f":"IF('NO SOCIOS'!E68>0,'NO SOCIOS'!E68,\"INCOMPLETO RECHAZAR\")","v":"INCOMPLETO RECHAZAR"},581]
[{"$f":"+'NO SOCIOS'!A56","v":"l NO SOCIO"},{"$f":"+'NO SOCIOS'!B56","v":0},{"$f":"+'NO SOCIOS'!C56","v":0},{"$f":"+'NO SOCIOS'!D56","v":"DOC. IDENTIDAD –sin puntos-:"},{"$f":"IF('NO SOCIOS'!E56>0,'NO SOCIOS'!E56,\"INCOMPLETO RECHAZAR\")","v":"INCOMPLETO RECHAZAR"},582]
[{"$f":"+'NO SOCIOS'!A62","v":"l NO SOCIO"},{"$f":"+'NO SOCIOS'!B62","v":0},{"$f":"+'NO SOCIOS'!C62","v":0},{"$f":"+'NO SOCIOS'!D62","v":"DOMICILIO REAL:"},{"$f":"IF('NO SOCIOS'!E62>0,'NO SOCIOS'!E62,\"INCOMPLETO RECHAZAR\")","v":"INCOMPLETO RECHAZAR"},583]
[{"$f":"+'NO SOCIOS'!A65","v":"l NO SOCIO"},{"$f":"+'NO SOCIOS'!B65","v":0},{"$f":"+'NO SOCIOS'!C65","v":0},{"$f":"+'NO SOCIOS'!D65","v":"ESTADO CIVIL:"},{"$f":"IF('NO SOCIOS'!E65>0,'NO SOCIOS'!E65,\"INCOMPLETO RECHAZAR\")","v":"INCOMPLETO RECHAZAR"},584]
[{"$f":"+'NO SOCIOS'!A58","v":"l NO SOCIO"},{"$f":"+'NO SOCIOS'!B58","v":0},{"$f":"+'NO SOCIOS'!C58","v":0},{"$f":"+'NO SOCIOS'!D58","v":"FECHA DE NACIMIENTO –dd/mm/aa-:"},{"$f":"IF('NO SOCIOS'!E58>0,'NO SOCIOS'!E58,\"INCOMPLETO RECHAZAR\")","v":"INCOMPLETO RECHAZAR"},585]
[{"$f":"+'NO SOCIOS'!A59","v":"l NO SOCIO"},{"$f":"+'NO SOCIOS'!B59","v":0},{"$f":"+'NO SOCIOS'!C59","v":0},{"$f":"+'NO SOCIOS'!D59","v":"LUGAR DE NACIMIENTO:"},{"$f":"IF('NO SOCIOS'!E59>0,'NO SOCIOS'!E59,\"INCOMPLETO RECHAZAR\")","v":"INCOMPLETO RECHAZAR"},586]
[{"$f":"+'NO SOCIOS'!A60","v":"l NO SOCIO"},{"$f":"+'NO SOCIOS'!B60","v":0},{"$f":"+'NO SOCIOS'!C60","v":0},{"$f":"+'NO SOCIOS'!D60","v":"NACIONALIDAD:"},{"$f":"IF('NO SOCIOS'!E60>0,'NO SOCIOS'!E60,\"INCOMPLETO RECHAZAR\")","v":"INCOMPLETO RECHAZAR"},587]
[{"$f":"+'NO SOCIOS'!A67","v":"l NO SOCIO"},{"$f":"+'NO SOCIOS'!B67","v":0},{"$f":"+'NO SOCIOS'!C67","v":0},{"$f":"+'NO SOCIOS'!D67","v":""},{"$f":"IF('NO SOCIOS'!E67>0,'NO SOCIOS'!E67,\"INCOMPLETO RECHAZAR\")","v":"INCOMPLETO RECHAZAR"},588]
[{"$f":"+'NO SOCIOS'!A71","v":"l NO SOCIO"},{"$f":"+'NO SOCIOS'!B71","v":0},{"$f":"+'NO SOCIOS'!C71","v":0},{"$f":"+'NO SOCIOS'!D71","v":"NOTA/OBSERVACIÓN -en mayúscula-:"},{"$f":"IF('NO SOCIOS'!E71>0,'NO SOCIOS'!E71,\"INCOMPLETO RECHAZAR\")","v":"INCOMPLETO RECHAZAR"},589]
[{"$f":"+'NO SOCIOS'!A61","v":"l NO SOCIO"},{"$f":"+'NO SOCIOS'!B61","v":0},{"$f":"+'NO SOCIOS'!C61","v":0},{"$f":"+'NO SOCIOS'!D61","v":"PROFESIÓN/OFICIO:"},{"$f":"IF('NO SOCIOS'!E61>0,'NO SOCIOS'!E61,\"INCOMPLETO RECHAZAR\")","v":"INCOMPLETO RECHAZAR"},590]
[{"$f":"+'NO SOCIOS'!A82","v":"l NO SOCIO"},{"$f":"+'NO SOCIOS'!B82","v":0},{"$f":"+'NO SOCIOS'!C82","v":0},{"$f":"+'NO SOCIOS'!D82","v":""},{"$f":"IF('NO SOCIOS'!E82>0,'NO SOCIOS'!E82,\"INCOMPLETO RECHAZAR\")","v":"INCOMPLETO RECHAZAR"},591]
[{"$f":"+'NO SOCIOS'!A79","v":"l NO SOCIO"},{"$f":"+'NO SOCIOS'!B79","v":0},{"$f":"+'NO SOCIOS'!C79","v":0},{"$f":"+'NO SOCIOS'!D79","v":"CEL/TEL :"},{"$f":"IF('NO SOCIOS'!E79>0,'NO SOCIOS'!E79,\"INCOMPLETO RECHAZAR\")","v":"INCOMPLETO RECHAZAR"},592]
[{"$f":"+'NO SOCIOS'!A73","v":"l NO SOCIO"},{"$f":"+'NO SOCIOS'!B73","v":0},{"$f":"+'NO SOCIOS'!C73","v":0},{"$f":"+'NO SOCIOS'!D73","v":"CUIT/CUIL –sin puntos ni barras-:"},{"$f":"IF('NO SOCIOS'!E73>0,'NO SOCIOS'!E73,\"INCOMPLETO RECHAZAR\")","v":"INCOMPLETO RECHAZAR"},593]
[{"$f":"+'NO SOCIOS'!A84","v":"l NO SOCIO"},{"$f":"+'NO SOCIOS'!B84","v":0},{"$f":"+'NO SOCIOS'!C84","v":0},{"$f":"+'NO SOCIOS'!D84","v":""},{"$f":"IF('NO SOCIOS'!E84>0,'NO SOCIOS'!E84,\"INCOMPLETO RECHAZAR\")","v":"INCOMPLETO RECHAZAR"},594]
[{"$f":"+'NO SOCIOS'!A72","v":"l NO SOCIO"},{"$f":"+'NO SOCIOS'!B72","v":0},{"$f":"+'NO SOCIOS'!C72","v":0},{"$f":"+'NO SOCIOS'!D72","v":"DOC. IDENTIDAD –sin puntos-:"},{"$f":"IF('NO SOCIOS'!E72>0,'NO SOCIOS'!E72,\"INCOMPLETO RECHAZAR\")","v":"INCOMPLETO RECHAZAR"},595]
[{"$f":"+'NO SOCIOS'!A78","v":"l NO SOCIO"},{"$f":"+'NO SOCIOS'!B78","v":0},{"$f":"+'NO SOCIOS'!C78","v":0},{"$f":"+'NO SOCIOS'!D78","v":"DOMICILIO REAL:"},{"$f":"IF('NO SOCIOS'!E78>0,'NO SOCIOS'!E78,\"INCOMPLETO RECHAZAR\")","v":"INCOMPLETO RECHAZAR"},596]
[{"$f":"+'NO SOCIOS'!A81","v":"l NO SOCIO"},{"$f":"+'NO SOCIOS'!B81","v":0},{"$f":"+'NO SOCIOS'!C81","v":0},{"$f":"+'NO SOCIOS'!D81","v":"ESTADO CIVIL:"},{"$f":"IF('NO SOCIOS'!E81>0,'NO SOCIOS'!E81,\"INCOMPLETO RECHAZAR\")","v":"INCOMPLETO RECHAZAR"},597]
[{"$f":"+'NO SOCIOS'!A74","v":"l NO SOCIO"},{"$f":"+'NO SOCIOS'!B74","v":0},{"$f":"+'NO SOCIOS'!C74","v":0},{"$f":"+'NO SOCIOS'!D74","v":"FECHA DE NACIMIENTO –dd/mm/aa-:"},{"$f":"IF('NO SOCIOS'!E74>0,'NO SOCIOS'!E74,\"INCOMPLETO RECHAZAR\")","v":"INCOMPLETO RECHAZAR"},598]
[{"$f":"+'NO SOCIOS'!A75","v":"l NO SOCIO"},{"$f":"+'NO SOCIOS'!B75","v":0},{"$f":"+'NO SOCIOS'!C75","v":0},{"$f":"+'NO SOCIOS'!D75","v":"LUGAR DE NACIMIENTO:"},{"$f":"IF('NO SOCIOS'!E75>0,'NO SOCIOS'!E75,\"INCOMPLETO RECHAZAR\")","v":"INCOMPLETO RECHAZAR"},599]
[{"$f":"+'NO SOCIOS'!A76","v":"l NO SOCIO"},{"$f":"+'NO SOCIOS'!B76","v":0},{"$f":"+'NO SOCIOS'!C76","v":0},{"$f":"+'NO SOCIOS'!D76","v":"NACIONALIDAD:"},{"$f":"IF('NO SOCIOS'!E76>0,'NO SOCIOS'!E76,\"INCOMPLETO RECHAZAR\")","v":"INCOMPLETO RECHAZAR"},600]
[{"$f":"+'NO SOCIOS'!A83","v":"l NO SOCIO"},{"$f":"+'NO SOCIOS'!B83","v":0},{"$f":"+'NO SOCIOS'!C83","v":0},{"$f":"+'NO SOCIOS'!D83","v":""},{"$f":"IF('NO SOCIOS'!E83>0,'NO SOCIOS'!E83,\"INCOMPLETO RECHAZAR\")","v":"INCOMPLETO RECHAZAR"},601]
[{"$f":"+'NO SOCIOS'!A87","v":"l NO SOCIO"},{"$f":"+'NO SOCIOS'!B87","v":0},{"$f":"+'NO SOCIOS'!C87","v":0},{"$f":"+'NO SOCIOS'!D87","v":"NOTA/OBSERVACIÓN -en mayúscula-:"},{"$f":"IF('NO SOCIOS'!E87>0,'NO SOCIOS'!E87,\"INCOMPLETO RECHAZAR\")","v":"INCOMPLETO RECHAZAR"},602]
[{"$f":"+'NO SOCIOS'!A77","v":"l NO SOCIO"},{"$f":"+'NO SOCIOS'!B77","v":0},{"$f":"+'NO SOCIOS'!C77","v":0},{"$f":"+'NO SOCIOS'!D77","v":"PROFESIÓN/OFICIO:"},{"$f":"IF('NO SOCIOS'!E77>0,'NO SOCIOS'!E77,\"INCOMPLETO RECHAZAR\")","v":"INCOMPLETO RECHAZAR"},603]
[{"$f":"+'NO SOCIOS'!A98","v":"l NO SOCIO"},{"$f":"+'NO SOCIOS'!B98","v":0},{"$f":"+'NO SOCIOS'!C98","v":0},{"$f":"+'NO SOCIOS'!D98","v":""},{"$f":"IF('NO SOCIOS'!E98>0,'NO SOCIOS'!E98,\"INCOMPLETO RECHAZAR\")","v":"INCOMPLETO RECHAZAR"},604]
[{"$f":"+'NO SOCIOS'!A95","v":"l NO SOCIO"},{"$f":"+'NO SOCIOS'!B95","v":0},{"$f":"+'NO SOCIOS'!C95","v":0},{"$f":"+'NO SOCIOS'!D95","v":"CEL/TEL :"},{"$f":"IF('NO SOCIOS'!E95>0,'NO SOCIOS'!E95,\"INCOMPLETO RECHAZAR\")","v":"INCOMPLETO RECHAZAR"},605]
[{"$f":"+'NO SOCIOS'!A89","v":"l NO SOCIO"},{"$f":"+'NO SOCIOS'!B89","v":0},{"$f":"+'NO SOCIOS'!C89","v":0},{"$f":"+'NO SOCIOS'!D89","v":"CUIT/CUIL –sin puntos ni barras-:"},{"$f":"IF('NO SOCIOS'!E89>0,'NO SOCIOS'!E89,\"INCOMPLETO RECHAZAR\")","v":"INCOMPLETO RECHAZAR"},606]
[{"$f":"+'NO SOCIOS'!A100","v":"l NO SOCIO"},{"$f":"+'NO SOCIOS'!B100","v":0},{"$f":"+'NO SOCIOS'!C100","v":0},{"$f":"+'NO SOCIOS'!D100","v":""},{"$f":"IF('NO SOCIOS'!E100>0,'NO SOCIOS'!E100,\"INCOMPLETO RECHAZAR\")","v":"INCOMPLETO RECHAZAR"},607]
[{"$f":"+'NO SOCIOS'!A88","v":"l NO SOCIO"},{"$f":"+'NO SOCIOS'!B88","v":0},{"$f":"+'NO SOCIOS'!C88","v":0},{"$f":"+'NO SOCIOS'!D88","v":"DOC. IDENTIDAD –sin puntos-:"},{"$f":"IF('NO SOCIOS'!E88>0,'NO SOCIOS'!E88,\"INCOMPLETO RECHAZAR\")","v":"INCOMPLETO RECHAZAR"},608]
[{"$f":"+'NO SOCIOS'!A94","v":"l NO SOCIO"},{"$f":"+'NO SOCIOS'!B94","v":0},{"$f":"+'NO SOCIOS'!C94","v":0},{"$f":"+'NO SOCIOS'!D94","v":"DOMICILIO REAL:"},{"$f":"IF('NO SOCIOS'!E94>0,'NO SOCIOS'!E94,\"INCOMPLETO RECHAZAR\")","v":"INCOMPLETO RECHAZAR"},609]
[{"$f":"+'NO SOCIOS'!A97","v":"l NO SOCIO"},{"$f":"+'NO SOCIOS'!B97","v":0},{"$f":"+'NO SOCIOS'!C97","v":0},{"$f":"+'NO SOCIOS'!D97","v":"ESTADO CIVIL:"},{"$f":"IF('NO SOCIOS'!E97>0,'NO SOCIOS'!E97,\"INCOMPLETO RECHAZAR\")","v":"INCOMPLETO RECHAZAR"},610]
[{"$f":"+'NO SOCIOS'!A90","v":"l NO SOCIO"},{"$f":"+'NO SOCIOS'!B90","v":0},{"$f":"+'NO SOCIOS'!C90","v":0},{"$f":"+'NO SOCIOS'!D90","v":"FECHA DE NACIMIENTO –dd/mm/aa-:"},{"$f":"IF('NO SOCIOS'!E90>0,'NO SOCIOS'!E90,\"INCOMPLETO RECHAZAR\")","v":"INCOMPLETO RECHAZAR"},611]
[{"$f":"+'NO SOCIOS'!A91","v":"l NO SOCIO"},{"$f":"+'NO SOCIOS'!B91","v":0},{"$f":"+'NO SOCIOS'!C91","v":0},{"$f":"+'NO SOCIOS'!D91","v":"LUGAR DE NACIMIENTO:"},{"$f":"IF('NO SOCIOS'!E91>0,'NO SOCIOS'!E91,\"INCOMPLETO RECHAZAR\")","v":"INCOMPLETO RECHAZAR"},612]
[{"$f":"+'NO SOCIOS'!A92","v":"l NO SOCIO"},{"$f":"+'NO SOCIOS'!B92","v":0},{"$f":"+'NO SOCIOS'!C92","v":0},{"$f":"+'NO SOCIOS'!D92","v":"NACIONALIDAD:"},{"$f":"IF('NO SOCIOS'!E92>0,'NO SOCIOS'!E92,\"INCOMPLETO RECHAZAR\")","v":"INCOMPLETO RECHAZAR"},613]
[{"$f":"+'NO SOCIOS'!A99","v":"l NO SOCIO"},{"$f":"+'NO SOCIOS'!B99","v":0},{"$f":"+'NO SOCIOS'!C99","v":0},{"$f":"+'NO SOCIOS'!D99","v":""},{"$f":"IF('NO SOCIOS'!E99>0,'NO SOCIOS'!E99,\"INCOMPLETO RECHAZAR\")","v":"INCOMPLETO RECHAZAR"},614]
[{"$f":"+'NO SOCIOS'!A103","v":"l NO SOCIO"},{"$f":"+'NO SOCIOS'!B103","v":0},{"$f":"+'NO SOCIOS'!C103","v":0},{"$f":"+'NO SOCIOS'!D103","v":"NOTA/OBSERVACIÓN -en mayúscula-:"},{"$f":"IF('NO SOCIOS'!E103>0,'NO SOCIOS'!E103,\"INCOMPLETO RECHAZAR\")","v":"INCOMPLETO RECHAZAR"},615]
[{"$f":"+'NO SOCIOS'!A93","v":"l NO SOCIO"},{"$f":"+'NO SOCIOS'!B93","v":0},{"$f":"+'NO SOCIOS'!C93","v":0},{"$f":"+'NO SOCIOS'!D93","v":"PROFESIÓN/OFICIO:"},{"$f":"IF('NO SOCIOS'!E93>0,'NO SOCIOS'!E93,\"INCOMPLETO RECHAZAR\")","v":"INCOMPLETO RECHAZAR"},616]
[{"$f":"+'NO SOCIOS'!A114","v":"l NO SOCIO"},{"$f":"+'NO SOCIOS'!B114","v":0},{"$f":"+'NO SOCIOS'!C114","v":0},{"$f":"+'NO SOCIOS'!D114","v":""},{"$f":"IF('NO SOCIOS'!E114>0,'NO SOCIOS'!E114,\"INCOMPLETO RECHAZAR\")","v":"INCOMPLETO RECHAZAR"},617]
[{"$f":"+'NO SOCIOS'!A111","v":"l NO SOCIO"},{"$f":"+'NO SOCIOS'!B111","v":0},{"$f":"+'NO SOCIOS'!C111","v":0},{"$f":"+'NO SOCIOS'!D111","v":"CEL/TEL :"},{"$f":"IF('NO SOCIOS'!E111>0,'NO SOCIOS'!E111,\"INCOMPLETO RECHAZAR\")","v":"INCOMPLETO RECHAZAR"},618]
[{"$f":"+'NO SOCIOS'!A105","v":"l NO SOCIO"},{"$f":"+'NO SOCIOS'!B105","v":0},{"$f":"+'NO SOCIOS'!C105","v":0},{"$f":"+'NO SOCIOS'!D105","v":"CUIT/CUIL –sin puntos ni barras-:"},{"$f":"IF('NO SOCIOS'!E105>0,'NO SOCIOS'!E105,\"INCOMPLETO RECHAZAR\")","v":"INCOMPLETO RECHAZAR"},619]
[{"$f":"+'NO SOCIOS'!A116","v":"l NO SOCIO"},{"$f":"+'NO SOCIOS'!B116","v":0},{"$f":"+'NO SOCIOS'!C116","v":0},{"$f":"+'NO SOCIOS'!D116","v":""},{"$f":"IF('NO SOCIOS'!E116>0,'NO SOCIOS'!E116,\"INCOMPLETO RECHAZAR\")","v":"INCOMPLETO RECHAZAR"},620]
[{"$f":"+'NO SOCIOS'!A104","v":"l NO SOCIO"},{"$f":"+'NO SOCIOS'!B104","v":0},{"$f":"+'NO SOCIOS'!C104","v":0},{"$f":"+'NO SOCIOS'!D104","v":"DOC. IDENTIDAD –sin puntos-:"},{"$f":"IF('NO SOCIOS'!E104>0,'NO SOCIOS'!E104,\"INCOMPLETO RECHAZAR\")","v":"INCOMPLETO RECHAZAR"},621]
[{"$f":"+'NO SOCIOS'!A110","v":"l NO SOCIO"},{"$f":"+'NO SOCIOS'!B110","v":0},{"$f":"+'NO SOCIOS'!C110","v":0},{"$f":"+'NO SOCIOS'!D110","v":"DOMICILIO REAL:"},{"$f":"IF('NO SOCIOS'!E110>0,'NO SOCIOS'!E110,\"INCOMPLETO RECHAZAR\")","v":"INCOMPLETO RECHAZAR"},622]
[{"$f":"+'NO SOCIOS'!A113","v":"l NO SOCIO"},{"$f":"+'NO SOCIOS'!B113","v":0},{"$f":"+'NO SOCIOS'!C113","v":0},{"$f":"+'NO SOCIOS'!D113","v":"ESTADO CIVIL:"},{"$f":"IF('NO SOCIOS'!E113>0,'NO SOCIOS'!E113,\"INCOMPLETO RECHAZAR\")","v":"INCOMPLETO RECHAZAR"},623]
[{"$f":"+'NO SOCIOS'!A106","v":"l NO SOCIO"},{"$f":"+'NO SOCIOS'!B106","v":0},{"$f":"+'NO SOCIOS'!C106","v":0},{"$f":"+'NO SOCIOS'!D106","v":"FECHA DE NACIMIENTO –dd/mm/aa-:"},{"$f":"IF('NO SOCIOS'!E106>0,'NO SOCIOS'!E106,\"INCOMPLETO RECHAZAR\")","v":"INCOMPLETO RECHAZAR"},624]
[{"$f":"+'NO SOCIOS'!A107","v":"l NO SOCIO"},{"$f":"+'NO SOCIOS'!B107","v":0},{"$f":"+'NO SOCIOS'!C107","v":0},{"$f":"+'NO SOCIOS'!D107","v":"LUGAR DE NACIMIENTO:"},{"$f":"IF('NO SOCIOS'!E107>0,'NO SOCIOS'!E107,\"INCOMPLETO RECHAZAR\")","v":"INCOMPLETO RECHAZAR"},625]
[{"$f":"+'NO SOCIOS'!A108","v":"l NO SOCIO"},{"$f":"+'NO SOCIOS'!B108","v":0},{"$f":"+'NO SOCIOS'!C108","v":0},{"$f":"+'NO SOCIOS'!D108","v":"NACIONALIDAD:"},{"$f":"IF('NO SOCIOS'!E108>0,'NO SOCIOS'!E108,\"INCOMPLETO RECHAZAR\")","v":"INCOMPLETO RECHAZAR"},626]
[{"$f":"+'NO SOCIOS'!A115","v":"l NO SOCIO"},{"$f":"+'NO SOCIOS'!B115","v":0},{"$f":"+'NO SOCIOS'!C115","v":0},{"$f":"+'NO SOCIOS'!D115","v":""},{"$f":"IF('NO SOCIOS'!E115>0,'NO SOCIOS'!E115,\"INCOMPLETO RECHAZAR\")","v":"INCOMPLETO RECHAZAR"},627]
[{"$f":"+'NO SOCIOS'!A119","v":"l NO SOCIO"},{"$f":"+'NO SOCIOS'!B119","v":0},{"$f":"+'NO SOCIOS'!C119","v":0},{"$f":"+'NO SOCIOS'!D119","v":"NOTA/OBSERVACIÓN -en mayúscula-:"},{"$f":"IF('NO SOCIOS'!E119>0,'NO SOCIOS'!E119,\"INCOMPLETO RECHAZAR\")","v":"INCOMPLETO RECHAZAR"},628]
[{"$f":"+'NO SOCIOS'!A109","v":"l NO SOCIO"},{"$f":"+'NO SOCIOS'!B109","v":0},{"$f":"+'NO SOCIOS'!C109","v":0},{"$f":"+'NO SOCIOS'!D109","v":"PROFESIÓN/OFICIO:"},{"$f":"IF('NO SOCIOS'!E109>0,'NO SOCIOS'!E109,\"INCOMPLETO RECHAZAR\")","v":"INCOMPLETO RECHAZAR"},629]
[{"$f":"+'NO SOCIOS'!A130","v":"l NO SOCIO"},{"$f":"+'NO SOCIOS'!B130","v":0},{"$f":"+'NO SOCIOS'!C130","v":0},{"$f":"+'NO SOCIOS'!D130","v":""},{"$f":"IF('NO SOCIOS'!E130>0,'NO SOCIOS'!E130,\"INCOMPLETO RECHAZAR\")","v":"INCOMPLETO RECHAZAR"},630]
[{"$f":"+'NO SOCIOS'!A127","v":"l NO SOCIO"},{"$f":"+'NO SOCIOS'!B127","v":0},{"$f":"+'NO SOCIOS'!C127","v":0},{"$f":"+'NO SOCIOS'!D127","v":"CEL/TEL :"},{"$f":"IF('NO SOCIOS'!E127>0,'NO SOCIOS'!E127,\"INCOMPLETO RECHAZAR\")","v":"INCOMPLETO RECHAZAR"},631]
[{"$f":"+'NO SOCIOS'!A121","v":"l NO SOCIO"},{"$f":"+'NO SOCIOS'!B121","v":0},{"$f":"+'NO SOCIOS'!C121","v":0},{"$f":"+'NO SOCIOS'!D121","v":"CUIT/CUIL –sin puntos ni barras-:"},{"$f":"IF('NO SOCIOS'!E121>0,'NO SOCIOS'!E121,\"INCOMPLETO RECHAZAR\")","v":"INCOMPLETO RECHAZAR"},632]
[{"$f":"+'NO SOCIOS'!A132","v":"l NO SOCIO"},{"$f":"+'NO SOCIOS'!B132","v":0},{"$f":"+'NO SOCIOS'!C132","v":0},{"$f":"+'NO SOCIOS'!D132","v":""},{"$f":"IF('NO SOCIOS'!E132>0,'NO SOCIOS'!E132,\"INCOMPLETO RECHAZAR\")","v":"INCOMPLETO RECHAZAR"},633]
[{"$f":"+'NO SOCIOS'!A120","v":"l NO SOCIO"},{"$f":"+'NO SOCIOS'!B120","v":0},{"$f":"+'NO SOCIOS'!C120","v":0},{"$f":"+'NO SOCIOS'!D120","v":"DOC. IDENTIDAD –sin puntos-:"},{"$f":"IF('NO SOCIOS'!E120>0,'NO SOCIOS'!E120,\"INCOMPLETO RECHAZAR\")","v":"INCOMPLETO RECHAZAR"},634]
[{"$f":"+'NO SOCIOS'!A126","v":"l NO SOCIO"},{"$f":"+'NO SOCIOS'!B126","v":0},{"$f":"+'NO SOCIOS'!C126","v":0},{"$f":"+'NO SOCIOS'!D126","v":"DOMICILIO REAL:"},{"$f":"IF('NO SOCIOS'!E126>0,'NO SOCIOS'!E126,\"INCOMPLETO RECHAZAR\")","v":"INCOMPLETO RECHAZAR"},635]
[{"$f":"+'NO SOCIOS'!A129","v":"l NO SOCIO"},{"$f":"+'NO SOCIOS'!B129","v":0},{"$f":"+'NO SOCIOS'!C129","v":0},{"$f":"+'NO SOCIOS'!D129","v":"ESTADO CIVIL:"},{"$f":"IF('NO SOCIOS'!E129>0,'NO SOCIOS'!E129,\"INCOMPLETO RECHAZAR\")","v":"INCOMPLETO RECHAZAR"},636]
[{"$f":"+'NO SOCIOS'!A122","v":"l NO SOCIO"},{"$f":"+'NO SOCIOS'!B122","v":0},{"$f":"+'NO SOCIOS'!C122","v":0},{"$f":"+'NO SOCIOS'!D122","v":"FECHA DE NACIMIENTO –dd/mm/aa-:"},{"$f":"IF('NO SOCIOS'!E122>0,'NO SOCIOS'!E122,\"INCOMPLETO RECHAZAR\")","v":"INCOMPLETO RECHAZAR"},637]
[{"$f":"+'NO SOCIOS'!A123","v":"l NO SOCIO"},{"$f":"+'NO SOCIOS'!B123","v":0},{"$f":"+'NO SOCIOS'!C123","v":0},{"$f":"+'NO SOCIOS'!D123","v":"LUGAR DE NACIMIENTO:"},{"$f":"IF('NO SOCIOS'!E123>0,'NO SOCIOS'!E123,\"INCOMPLETO RECHAZAR\")","v":"INCOMPLETO RECHAZAR"},638]
[{"$f":"+'NO SOCIOS'!A124","v":"l NO SOCIO"},{"$f":"+'NO SOCIOS'!B124","v":0},{"$f":"+'NO SOCIOS'!C124","v":0},{"$f":"+'NO SOCIOS'!D124","v":"NACIONALIDAD:"},{"$f":"IF('NO SOCIOS'!E124>0,'NO SOCIOS'!E124,\"INCOMPLETO RECHAZAR\")","v":"INCOMPLETO RECHAZAR"},639]
[{"$f":"+'NO SOCIOS'!A131","v":"l NO SOCIO"},{"$f":"+'NO SOCIOS'!B131","v":0},{"$f":"+'NO SOCIOS'!C131","v":0},{"$f":"+'NO SOCIOS'!D131","v":""},{"$f":"IF('NO SOCIOS'!E131>0,'NO SOCIOS'!E131,\"INCOMPLETO RECHAZAR\")","v":"INCOMPLETO RECHAZAR"},640]
[{"$f":"+'NO SOCIOS'!A135","v":"l NO SOCIO"},{"$f":"+'NO SOCIOS'!B135","v":0},{"$f":"+'NO SOCIOS'!C135","v":0},{"$f":"+'NO SOCIOS'!D135","v":"NOTA/OBSERVACIÓN -en mayúscula-:"},{"$f":"IF('NO SOCIOS'!E135>0,'NO SOCIOS'!E135,\"INCOMPLETO RECHAZAR\")","v":"INCOMPLETO RECHAZAR"},641]
[{"$f":"+'NO SOCIOS'!A125","v":"l NO SOCIO"},{"$f":"+'NO SOCIOS'!B125","v":0},{"$f":"+'NO SOCIOS'!C125","v":0},{"$f":"+'NO SOCIOS'!D125","v":"PROFESIÓN/OFICIO:"},{"$f":"IF('NO SOCIOS'!E125>0,'NO SOCIOS'!E125,\"INCOMPLETO RECHAZAR\")","v":"INCOMPLETO RECHAZAR"},642]
[{"$f":"+'NO SOCIOS'!A146","v":"l NO SOCIO"},{"$f":"+'NO SOCIOS'!B146","v":0},{"$f":"+'NO SOCIOS'!C146","v":0},{"$f":"+'NO SOCIOS'!D146","v":""},{"$f":"IF('NO SOCIOS'!E146>0,'NO SOCIOS'!E146,\"INCOMPLETO RECHAZAR\")","v":"INCOMPLETO RECHAZAR"},643]
[{"$f":"+'NO SOCIOS'!A143","v":"l NO SOCIO"},{"$f":"+'NO SOCIOS'!B143","v":0},{"$f":"+'NO SOCIOS'!C143","v":0},{"$f":"+'NO SOCIOS'!D143","v":"CEL/TEL :"},{"$f":"IF('NO SOCIOS'!E143>0,'NO SOCIOS'!E143,\"INCOMPLETO RECHAZAR\")","v":"INCOMPLETO RECHAZAR"},644]
[{"$f":"+'NO SOCIOS'!A137","v":"l NO SOCIO"},{"$f":"+'NO SOCIOS'!B137","v":0},{"$f":"+'NO SOCIOS'!C137","v":0},{"$f":"+'NO SOCIOS'!D137","v":"CUIT/CUIL –sin puntos ni barras-:"},{"$f":"IF('NO SOCIOS'!E137>0,'NO SOCIOS'!E137,\"INCOMPLETO RECHAZAR\")","v":"INCOMPLETO RECHAZAR"},645]
[{"$f":"+'NO SOCIOS'!A148","v":"l NO SOCIO"},{"$f":"+'NO SOCIOS'!B148","v":0},{"$f":"+'NO SOCIOS'!C148","v":0},{"$f":"+'NO SOCIOS'!D148","v":""},{"$f":"IF('NO SOCIOS'!E148>0,'NO SOCIOS'!E148,\"INCOMPLETO RECHAZAR\")","v":"INCOMPLETO RECHAZAR"},646]
[{"$f":"+'NO SOCIOS'!A136","v":"l NO SOCIO"},{"$f":"+'NO SOCIOS'!B136","v":0},{"$f":"+'NO SOCIOS'!C136","v":0},{"$f":"+'NO SOCIOS'!D136","v":"DOC. IDENTIDAD –sin puntos-:"},{"$f":"IF('NO SOCIOS'!E136>0,'NO SOCIOS'!E136,\"INCOMPLETO RECHAZAR\")","v":"INCOMPLETO RECHAZAR"},647]
[{"$f":"+'NO SOCIOS'!A142","v":"l NO SOCIO"},{"$f":"+'NO SOCIOS'!B142","v":0},{"$f":"+'NO SOCIOS'!C142","v":0},{"$f":"+'NO SOCIOS'!D142","v":"DOMICILIO REAL:"},{"$f":"IF('NO SOCIOS'!E142>0,'NO SOCIOS'!E142,\"INCOMPLETO RECHAZAR\")","v":"INCOMPLETO RECHAZAR"},648]
[{"$f":"+'NO SOCIOS'!A145","v":"l NO SOCIO"},{"$f":"+'NO SOCIOS'!B145","v":0},{"$f":"+'NO SOCIOS'!C145","v":0},{"$f":"+'NO SOCIOS'!D145","v":"ESTADO CIVIL:"},{"$f":"IF('NO SOCIOS'!E145>0,'NO SOCIOS'!E145,\"INCOMPLETO RECHAZAR\")","v":"INCOMPLETO RECHAZAR"},649]
[{"$f":"+'NO SOCIOS'!A138","v":"l NO SOCIO"},{"$f":"+'NO SOCIOS'!B138","v":0},{"$f":"+'NO SOCIOS'!C138","v":0},{"$f":"+'NO SOCIOS'!D138","v":"FECHA DE NACIMIENTO –dd/mm/aa-:"},{"$f":"IF('NO SOCIOS'!E138>0,'NO SOCIOS'!E138,\"INCOMPLETO RECHAZAR\")","v":"INCOMPLETO RECHAZAR"},650]
[{"$f":"+'NO SOCIOS'!A139","v":"l NO SOCIO"},{"$f":"+'NO SOCIOS'!B139","v":0},{"$f":"+'NO SOCIOS'!C139","v":0},{"$f":"+'NO SOCIOS'!D139","v":"LUGAR DE NACIMIENTO:"},{"$f":"IF('NO SOCIOS'!E139>0,'NO SOCIOS'!E139,\"INCOMPLETO RECHAZAR\")","v":"INCOMPLETO RECHAZAR"},651]
[{"$f":"+'NO SOCIOS'!A140","v":"l NO SOCIO"},{"$f":"+'NO SOCIOS'!B140","v":0},{"$f":"+'NO SOCIOS'!C140","v":0},{"$f":"+'NO SOCIOS'!D140","v":"NACIONALIDAD:"},{"$f":"IF('NO SOCIOS'!E140>0,'NO SOCIOS'!E140,\"INCOMPLETO RECHAZAR\")","v":"INCOMPLETO RECHAZAR"},652]
[{"$f":"+'NO SOCIOS'!A147","v":"l NO SOCIO"},{"$f":"+'NO SOCIOS'!B147","v":0},{"$f":"+'NO SOCIOS'!C147","v":0},{"$f":"+'NO SOCIOS'!D147","v":""},{"$f":"IF('NO SOCIOS'!E147>0,'NO SOCIOS'!E147,\"INCOMPLETO RECHAZAR\")","v":"INCOMPLETO RECHAZAR"},653]
[{"$f":"+'NO SOCIOS'!A151","v":"l NO SOCIO"},{"$f":"+'NO SOCIOS'!B151","v":0},{"$f":"+'NO SOCIOS'!C151","v":0},{"$f":"+'NO SOCIOS'!D151","v":"NOTA/OBSERVACIÓN -en mayúscula-:"},{"$f":"IF('NO SOCIOS'!E151>0,'NO SOCIOS'!E151,\"INCOMPLETO RECHAZAR\")","v":"INCOMPLETO RECHAZAR"},654]
[{"$f":"+'NO SOCIOS'!A141","v":"l NO SOCIO"},{"$f":"+'NO SOCIOS'!B141","v":0},{"$f":"+'NO SOCIOS'!C141","v":0},{"$f":"+'NO SOCIOS'!D141","v":"PROFESIÓN/OFICIO:"},{"$f":"IF('NO SOCIOS'!E141>0,'NO SOCIOS'!E141,\"INCOMPLETO RECHAZAR\")","v":"INCOMPLETO RECHAZAR"},655]
[{"$f":"+'NO SOCIOS'!A162","v":"l NO SOCIO"},{"$f":"+'NO SOCIOS'!B162","v":0},{"$f":"+'NO SOCIOS'!C162","v":0},{"$f":"+'NO SOCIOS'!D162","v":""},{"$f":"IF('NO SOCIOS'!E162>0,'NO SOCIOS'!E162,\"INCOMPLETO RECHAZAR\")","v":"INCOMPLETO RECHAZAR"},656]
[{"$f":"+'NO SOCIOS'!A159","v":"l NO SOCIO"},{"$f":"+'NO SOCIOS'!B159","v":0},{"$f":"+'NO SOCIOS'!C159","v":0},{"$f":"+'NO SOCIOS'!D159","v":"CEL/TEL :"},{"$f":"IF('NO SOCIOS'!E159>0,'NO SOCIOS'!E159,\"INCOMPLETO RECHAZAR\")","v":"INCOMPLETO RECHAZAR"},657]
[{"$f":"+'NO SOCIOS'!A153","v":"l NO SOCIO"},{"$f":"+'NO SOCIOS'!B153","v":0},{"$f":"+'NO SOCIOS'!C153","v":0},{"$f":"+'NO SOCIOS'!D153","v":"CUIT/CUIL –sin puntos ni barras-:"},{"$f":"IF('NO SOCIOS'!E153>0,'NO SOCIOS'!E153,\"INCOMPLETO RECHAZAR\")","v":"INCOMPLETO RECHAZAR"},658]
[{"$f":"+'NO SOCIOS'!A164","v":"l NO SOCIO"},{"$f":"+'NO SOCIOS'!B164","v":0},{"$f":"+'NO SOCIOS'!C164","v":0},{"$f":"+'NO SOCIOS'!D164","v":""},{"$f":"IF('NO SOCIOS'!E164>0,'NO SOCIOS'!E164,\"INCOMPLETO RECHAZAR\")","v":"INCOMPLETO RECHAZAR"},659]
[{"$f":"+'NO SOCIOS'!A152","v":"l NO SOCIO"},{"$f":"+'NO SOCIOS'!B152","v":0},{"$f":"+'NO SOCIOS'!C152","v":0},{"$f":"+'NO SOCIOS'!D152","v":"DOC. IDENTIDAD –sin puntos-:"},{"$f":"IF('NO SOCIOS'!E152>0,'NO SOCIOS'!E152,\"INCOMPLETO RECHAZAR\")","v":"INCOMPLETO RECHAZAR"},660]
[{"$f":"+'NO SOCIOS'!A158","v":"l NO SOCIO"},{"$f":"+'NO SOCIOS'!B158","v":0},{"$f":"+'NO SOCIOS'!C158","v":0},{"$f":"+'NO SOCIOS'!D158","v":"DOMICILIO REAL:"},{"$f":"IF('NO SOCIOS'!E158>0,'NO SOCIOS'!E158,\"INCOMPLETO RECHAZAR\")","v":"INCOMPLETO RECHAZAR"},661]
[{"$f":"+'NO SOCIOS'!A161","v":"l NO SOCIO"},{"$f":"+'NO SOCIOS'!B161","v":0},{"$f":"+'NO SOCIOS'!C161","v":0},{"$f":"+'NO SOCIOS'!D161","v":"ESTADO CIVIL:"},{"$f":"IF('NO SOCIOS'!E161>0,'NO SOCIOS'!E161,\"INCOMPLETO RECHAZAR\")","v":"INCOMPLETO RECHAZAR"},662]
[{"$f":"+'NO SOCIOS'!A154","v":"l NO SOCIO"},{"$f":"+'NO SOCIOS'!B154","v":0},{"$f":"+'NO SOCIOS'!C154","v":0},{"$f":"+'NO SOCIOS'!D154","v":"FECHA DE NACIMIENTO –dd/mm/aa-:"},{"$f":"IF('NO SOCIOS'!E154>0,'NO SOCIOS'!E154,\"INCOMPLETO RECHAZAR\")","v":"INCOMPLETO RECHAZAR"},663]
[{"$f":"+'NO SOCIOS'!A155","v":"l NO SOCIO"},{"$f":"+'NO SOCIOS'!B155","v":0},{"$f":"+'NO SOCIOS'!C155","v":0},{"$f":"+'NO SOCIOS'!D155","v":"LUGAR DE NACIMIENTO:"},{"$f":"IF('NO SOCIOS'!E155>0,'NO SOCIOS'!E155,\"INCOMPLETO RECHAZAR\")","v":"INCOMPLETO RECHAZAR"},664]
[{"$f":"+'NO SOCIOS'!A156","v":"l NO SOCIO"},{"$f":"+'NO SOCIOS'!B156","v":0},{"$f":"+'NO SOCIOS'!C156","v":0},{"$f":"+'NO SOCIOS'!D156","v":"NACIONALIDAD:"},{"$f":"IF('NO SOCIOS'!E156>0,'NO SOCIOS'!E156,\"INCOMPLETO RECHAZAR\")","v":"INCOMPLETO RECHAZAR"},665]
[{"$f":"+'NO SOCIOS'!A163","v":"l NO SOCIO"},{"$f":"+'NO SOCIOS'!B163","v":0},{"$f":"+'NO SOCIOS'!C163","v":0},{"$f":"+'NO SOCIOS'!D163","v":""},{"$f":"IF('NO SOCIOS'!E163>0,'NO SOCIOS'!E163,\"INCOMPLETO RECHAZAR\")","v":"INCOMPLETO RECHAZAR"},666]
[{"$f":"+'NO SOCIOS'!A167","v":"l NO SOCIO"},{"$f":"+'NO SOCIOS'!B167","v":0},{"$f":"+'NO SOCIOS'!C167","v":0},{"$f":"+'NO SOCIOS'!D167","v":"NOTA/OBSERVACIÓN -en mayúscula-:"},{"$f":"IF('NO SOCIOS'!E167>0,'NO SOCIOS'!E167,\"INCOMPLETO RECHAZAR\")","v":"INCOMPLETO RECHAZAR"},667]
[{"$f":"+'NO SOCIOS'!A157","v":"l NO SOCIO"},{"$f":"+'NO SOCIOS'!B157","v":0},{"$f":"+'NO SOCIOS'!C157","v":0},{"$f":"+'NO SOCIOS'!D157","v":"PROFESIÓN/OFICIO:"},{"$f":"IF('NO SOCIOS'!E157>0,'NO SOCIOS'!E157,\"INCOMPLETO RECHAZAR\")","v":"INCOMPLETO RECHAZAR"},668]
[{"$f":"+'NO SOCIOS'!A178","v":"l NO SOCIO"},{"$f":"+'NO SOCIOS'!B178","v":0},{"$f":"+'NO SOCIOS'!C178","v":0},{"$f":"+'NO SOCIOS'!D178","v":""},{"$f":"IF('NO SOCIOS'!E178>0,'NO SOCIOS'!E178,\"INCOMPLETO RECHAZAR\")","v":"INCOMPLETO RECHAZAR"},669]
[{"$f":"+'NO SOCIOS'!A175","v":"l NO SOCIO"},{"$f":"+'NO SOCIOS'!B175","v":0},{"$f":"+'NO SOCIOS'!C175","v":0},{"$f":"+'NO SOCIOS'!D175","v":"CEL/TEL :"},{"$f":"IF('NO SOCIOS'!E175>0,'NO SOCIOS'!E175,\"INCOMPLETO RECHAZAR\")","v":"INCOMPLETO RECHAZAR"},670]
[{"$f":"+'NO SOCIOS'!A169","v":"l NO SOCIO"},{"$f":"+'NO SOCIOS'!B169","v":0},{"$f":"+'NO SOCIOS'!C169","v":0},{"$f":"+'NO SOCIOS'!D169","v":"CUIT/CUIL –sin puntos ni barras-:"},{"$f":"IF('NO SOCIOS'!E169>0,'NO SOCIOS'!E169,\"INCOMPLETO RECHAZAR\")","v":"INCOMPLETO RECHAZAR"},671]
[{"$f":"+'NO SOCIOS'!A180","v":"l NO SOCIO"},{"$f":"+'NO SOCIOS'!B180","v":0},{"$f":"+'NO SOCIOS'!C180","v":0},{"$f":"+'NO SOCIOS'!D180","v":""},{"$f":"IF('NO SOCIOS'!E180>0,'NO SOCIOS'!E180,\"INCOMPLETO RECHAZAR\")","v":"INCOMPLETO RECHAZAR"},672]
[{"$f":"+'NO SOCIOS'!A168","v":"l NO SOCIO"},{"$f":"+'NO SOCIOS'!B168","v":0},{"$f":"+'NO SOCIOS'!C168","v":0},{"$f":"+'NO SOCIOS'!D168","v":"DOC. IDENTIDAD –sin puntos-:"},{"$f":"IF('NO SOCIOS'!E168>0,'NO SOCIOS'!E168,\"INCOMPLETO RECHAZAR\")","v":"INCOMPLETO RECHAZAR"},673]
[{"$f":"+'NO SOCIOS'!A174","v":"l NO SOCIO"},{"$f":"+'NO SOCIOS'!B174","v":0},{"$f":"+'NO SOCIOS'!C174","v":0},{"$f":"+'NO SOCIOS'!D174","v":"DOMICILIO REAL:"},{"$f":"IF('NO SOCIOS'!E174>0,'NO SOCIOS'!E174,\"INCOMPLETO RECHAZAR\")","v":"INCOMPLETO RECHAZAR"},674]
[{"$f":"+'NO SOCIOS'!A177","v":"l NO SOCIO"},{"$f":"+'NO SOCIOS'!B177","v":0},{"$f":"+'NO SOCIOS'!C177","v":0},{"$f":"+'NO SOCIOS'!D177","v":"ESTADO CIVIL:"},{"$f":"IF('NO SOCIOS'!E177>0,'NO SOCIOS'!E177,\"INCOMPLETO RECHAZAR\")","v":"INCOMPLETO RECHAZAR"},675]
[{"$f":"+'NO SOCIOS'!A170","v":"l NO SOCIO"},{"$f":"+'NO SOCIOS'!B170","v":0},{"$f":"+'NO SOCIOS'!C170","v":0},{"$f":"+'NO SOCIOS'!D170","v":"FECHA DE NACIMIENTO –dd/mm/aa-:"},{"$f":"IF('NO SOCIOS'!E170>0,'NO SOCIOS'!E170,\"INCOMPLETO RECHAZAR\")","v":"INCOMPLETO RECHAZAR"},676]
[{"$f":"+'NO SOCIOS'!A171","v":"l NO SOCIO"},{"$f":"+'NO SOCIOS'!B171","v":0},{"$f":"+'NO SOCIOS'!C171","v":0},{"$f":"+'NO SOCIOS'!D171","v":"LUGAR DE NACIMIENTO:"},{"$f":"IF('NO SOCIOS'!E171>0,'NO SOCIOS'!E171,\"INCOMPLETO RECHAZAR\")","v":"INCOMPLETO RECHAZAR"},677]
[{"$f":"+'NO SOCIOS'!A172","v":"l NO SOCIO"},{"$f":"+'NO SOCIOS'!B172","v":0},{"$f":"+'NO SOCIOS'!C172","v":0},{"$f":"+'NO SOCIOS'!D172","v":"NACIONALIDAD:"},{"$f":"IF('NO SOCIOS'!E172>0,'NO SOCIOS'!E172,\"INCOMPLETO RECHAZAR\")","v":"INCOMPLETO RECHAZAR"},678]
[{"$f":"+'NO SOCIOS'!A179","v":"l NO SOCIO"},{"$f":"+'NO SOCIOS'!B179","v":0},{"$f":"+'NO SOCIOS'!C179","v":0},{"$f":"+'NO SOCIOS'!D179","v":""},{"$f":"IF('NO SOCIOS'!E179>0,'NO SOCIOS'!E179,\"INCOMPLETO RECHAZAR\")","v":"INCOMPLETO RECHAZAR"},679]
[{"$f":"+'NO SOCIOS'!A183","v":"l NO SOCIO"},{"$f":"+'NO SOCIOS'!B183","v":0},{"$f":"+'NO SOCIOS'!C183","v":0},{"$f":"+'NO SOCIOS'!D183","v":"NOTA/OBSERVACIÓN -en mayúscula-:"},{"$f":"IF('NO SOCIOS'!E183>0,'NO SOCIOS'!E183,\"INCOMPLETO RECHAZAR\")","v":"INCOMPLETO RECHAZAR"},680]
[{"$f":"+'NO SOCIOS'!A173","v":"l NO SOCIO"},{"$f":"+'NO SOCIOS'!B173","v":0},{"$f":"+'NO SOCIOS'!C173","v":0},{"$f":"+'NO SOCIOS'!D173","v":"PROFESIÓN/OFICIO:"},{"$f":"IF('NO SOCIOS'!E173>0,'NO SOCIOS'!E173,\"INCOMPLETO RECHAZAR\")","v":"INCOMPLETO RECHAZAR"},681]
[{"$f":"+'NO SOCIOS'!A194","v":"l NO SOCIO"},{"$f":"+'NO SOCIOS'!B194","v":0},{"$f":"+'NO SOCIOS'!C194","v":0},{"$f":"+'NO SOCIOS'!D194","v":""},{"$f":"IF('NO SOCIOS'!E194>0,'NO SOCIOS'!E194,\"INCOMPLETO RECHAZAR\")","v":"INCOMPLETO RECHAZAR"},682]
[{"$f":"+'NO SOCIOS'!A191","v":"l NO SOCIO"},{"$f":"+'NO SOCIOS'!B191","v":0},{"$f":"+'NO SOCIOS'!C191","v":0},{"$f":"+'NO SOCIOS'!D191","v":"CEL/TEL :"},{"$f":"IF('NO SOCIOS'!E191>0,'NO SOCIOS'!E191,\"INCOMPLETO RECHAZAR\")","v":"INCOMPLETO RECHAZAR"},683]
[{"$f":"+'NO SOCIOS'!A185","v":"l NO SOCIO"},{"$f":"+'NO SOCIOS'!B185","v":0},{"$f":"+'NO SOCIOS'!C185","v":0},{"$f":"+'NO SOCIOS'!D185","v":"CUIT/CUIL –sin puntos ni barras-:"},{"$f":"IF('NO SOCIOS'!E185>0,'NO SOCIOS'!E185,\"INCOMPLETO RECHAZAR\")","v":"INCOMPLETO RECHAZAR"},684]
[{"$f":"+'NO SOCIOS'!A196","v":"l NO SOCIO"},{"$f":"+'NO SOCIOS'!B196","v":0},{"$f":"+'NO SOCIOS'!C196","v":0},{"$f":"+'NO SOCIOS'!D196","v":""},{"$f":"IF('NO SOCIOS'!E196>0,'NO SOCIOS'!E196,\"INCOMPLETO RECHAZAR\")","v":"INCOMPLETO RECHAZAR"},685]
[{"$f":"+'NO SOCIOS'!A184","v":"l NO SOCIO"},{"$f":"+'NO SOCIOS'!B184","v":0},{"$f":"+'NO SOCIOS'!C184","v":0},{"$f":"+'NO SOCIOS'!D184","v":"DOC. IDENTIDAD –sin puntos-:"},{"$f":"IF('NO SOCIOS'!E184>0,'NO SOCIOS'!E184,\"INCOMPLETO RECHAZAR\")","v":"INCOMPLETO RECHAZAR"},686]
[{"$f":"+'NO SOCIOS'!A190","v":"l NO SOCIO"},{"$f":"+'NO SOCIOS'!B190","v":0},{"$f":"+'NO SOCIOS'!C190","v":0},{"$f":"+'NO SOCIOS'!D190","v":"DOMICILIO REAL:"},{"$f":"IF('NO SOCIOS'!E190>0,'NO SOCIOS'!E190,\"INCOMPLETO RECHAZAR\")","v":"INCOMPLETO RECHAZAR"},687]
[{"$f":"+'NO SOCIOS'!A193","v":"l NO SOCIO"},{"$f":"+'NO SOCIOS'!B193","v":0},{"$f":"+'NO SOCIOS'!C193","v":0},{"$f":"+'NO SOCIOS'!D193","v":"ESTADO CIVIL:"},{"$f":"IF('NO SOCIOS'!E193>0,'NO SOCIOS'!E193,\"INCOMPLETO RECHAZAR\")","v":"INCOMPLETO RECHAZAR"},688]
[{"$f":"+'NO SOCIOS'!A186","v":"l NO SOCIO"},{"$f":"+'NO SOCIOS'!B186","v":0},{"$f":"+'NO SOCIOS'!C186","v":0},{"$f":"+'NO SOCIOS'!D186","v":"FECHA DE NACIMIENTO –dd/mm/aa-:"},{"$f":"IF('NO SOCIOS'!E186>0,'NO SOCIOS'!E186,\"INCOMPLETO RECHAZAR\")","v":"INCOMPLETO RECHAZAR"},689]
[{"$f":"+'NO SOCIOS'!A187","v":"l NO SOCIO"},{"$f":"+'NO SOCIOS'!B187","v":0},{"$f":"+'NO SOCIOS'!C187","v":0},{"$f":"+'NO SOCIOS'!D187","v":"LUGAR DE NACIMIENTO:"},{"$f":"IF('NO SOCIOS'!E187>0,'NO SOCIOS'!E187,\"INCOMPLETO RECHAZAR\")","v":"INCOMPLETO RECHAZAR"},690]
[{"$f":"+'NO SOCIOS'!A188","v":"l NO SOCIO"},{"$f":"+'NO SOCIOS'!B188","v":0},{"$f":"+'NO SOCIOS'!C188","v":0},{"$f":"+'NO SOCIOS'!D188","v":"NACIONALIDAD:"},{"$f":"IF('NO SOCIOS'!E188>0,'NO SOCIOS'!E188,\"INCOMPLETO RECHAZAR\")","v":"INCOMPLETO RECHAZAR"},691]
[{"$f":"+'NO SOCIOS'!A195","v":"l NO SOCIO"},{"$f":"+'NO SOCIOS'!B195","v":0},{"$f":"+'NO SOCIOS'!C195","v":0},{"$f":"+'NO SOCIOS'!D195","v":""},{"$f":"IF('NO SOCIOS'!E195>0,'NO SOCIOS'!E195,\"INCOMPLETO RECHAZAR\")","v":"INCOMPLETO RECHAZAR"},692]
[{"$f":"+'NO SOCIOS'!A199","v":"l NO SOCIO"},{"$f":"+'NO SOCIOS'!B199","v":0},{"$f":"+'NO SOCIOS'!C199","v":0},{"$f":"+'NO SOCIOS'!D199","v":"NOTA/OBSERVACIÓN -en mayúscula-:"},{"$f":"IF('NO SOCIOS'!E199>0,'NO SOCIOS'!E199,\"INCOMPLETO RECHAZAR\")","v":"INCOMPLETO RECHAZAR"},693]
[{"$f":"+'NO SOCIOS'!A189","v":"l NO SOCIO"},{"$f":"+'NO SOCIOS'!B189","v":0},{"$f":"+'NO SOCIOS'!C189","v":0},{"$f":"+'NO SOCIOS'!D189","v":"PROFESIÓN/OFICIO:"},{"$f":"IF('NO SOCIOS'!E189>0,'NO SOCIOS'!E189,\"INCOMPLETO RECHAZAR\")","v":"INCOMPLETO RECHAZAR"},694]
[{"$f":"+'NO SOCIOS'!A210","v":"l NO SOCIO"},{"$f":"+'NO SOCIOS'!B210","v":0},{"$f":"+'NO SOCIOS'!C210","v":0},{"$f":"+'NO SOCIOS'!D210","v":""},{"$f":"IF('NO SOCIOS'!E210>0,'NO SOCIOS'!E210,\"INCOMPLETO RECHAZAR\")","v":"INCOMPLETO RECHAZAR"},695]
[{"$f":"+'NO SOCIOS'!A207","v":"l NO SOCIO"},{"$f":"+'NO SOCIOS'!B207","v":0},{"$f":"+'NO SOCIOS'!C207","v":0},{"$f":"+'NO SOCIOS'!D207","v":"CEL/TEL :"},{"$f":"IF('NO SOCIOS'!E207>0,'NO SOCIOS'!E207,\"INCOMPLETO RECHAZAR\")","v":"INCOMPLETO RECHAZAR"},696]
[{"$f":"+'NO SOCIOS'!A201","v":"l NO SOCIO"},{"$f":"+'NO SOCIOS'!B201","v":0},{"$f":"+'NO SOCIOS'!C201","v":0},{"$f":"+'NO SOCIOS'!D201","v":"CUIT/CUIL –sin puntos ni barras-:"},{"$f":"IF('NO SOCIOS'!E201>0,'NO SOCIOS'!E201,\"INCOMPLETO RECHAZAR\")","v":"INCOMPLETO RECHAZAR"},697]
[{"$f":"+'NO SOCIOS'!A212","v":"l NO SOCIO"},{"$f":"+'NO SOCIOS'!B212","v":0},{"$f":"+'NO SOCIOS'!C212","v":0},{"$f":"+'NO SOCIOS'!D212","v":""},{"$f":"IF('NO SOCIOS'!E212>0,'NO SOCIOS'!E212,\"INCOMPLETO RECHAZAR\")","v":"INCOMPLETO RECHAZAR"},698]
[{"$f":"+'NO SOCIOS'!A200","v":"l NO SOCIO"},{"$f":"+'NO SOCIOS'!B200","v":0},{"$f":"+'NO SOCIOS'!C200","v":0},{"$f":"+'NO SOCIOS'!D200","v":"DOC. IDENTIDAD –sin puntos-:"},{"$f":"IF('NO SOCIOS'!E200>0,'NO SOCIOS'!E200,\"INCOMPLETO RECHAZAR\")","v":"INCOMPLETO RECHAZAR"},699]
[{"$f":"+'NO SOCIOS'!A206","v":"l NO SOCIO"},{"$f":"+'NO SOCIOS'!B206","v":0},{"$f":"+'NO SOCIOS'!C206","v":0},{"$f":"+'NO SOCIOS'!D206","v":"DOMICILIO REAL:"},{"$f":"IF('NO SOCIOS'!E206>0,'NO SOCIOS'!E206,\"INCOMPLETO RECHAZAR\")","v":"INCOMPLETO RECHAZAR"},700]
[{"$f":"+'NO SOCIOS'!A209","v":"l NO SOCIO"},{"$f":"+'NO SOCIOS'!B209","v":0},{"$f":"+'NO SOCIOS'!C209","v":0},{"$f":"+'NO SOCIOS'!D209","v":"ESTADO CIVIL:"},{"$f":"IF('NO SOCIOS'!E209>0,'NO SOCIOS'!E209,\"INCOMPLETO RECHAZAR\")","v":"INCOMPLETO RECHAZAR"},701]
[{"$f":"+'NO SOCIOS'!A202","v":"l NO SOCIO"},{"$f":"+'NO SOCIOS'!B202","v":0},{"$f":"+'NO SOCIOS'!C202","v":0},{"$f":"+'NO SOCIOS'!D202","v":"FECHA DE NACIMIENTO –dd/mm/aa-:"},{"$f":"IF('NO SOCIOS'!E202>0,'NO SOCIOS'!E202,\"INCOMPLETO RECHAZAR\")","v":"INCOMPLETO RECHAZAR"},702]
[{"$f":"+'NO SOCIOS'!A203","v":"l NO SOCIO"},{"$f":"+'NO SOCIOS'!B203","v":0},{"$f":"+'NO SOCIOS'!C203","v":0},{"$f":"+'NO SOCIOS'!D203","v":"LUGAR DE NACIMIENTO:"},{"$f":"IF('NO SOCIOS'!E203>0,'NO SOCIOS'!E203,\"INCOMPLETO RECHAZAR\")","v":"INCOMPLETO RECHAZAR"},703]
[{"$f":"+'NO SOCIOS'!A204","v":"l NO SOCIO"},{"$f":"+'NO SOCIOS'!B204","v":0},{"$f":"+'NO SOCIOS'!C204","v":0},{"$f":"+'NO SOCIOS'!D204","v":"NACIONALIDAD:"},{"$f":"IF('NO SOCIOS'!E204>0,'NO SOCIOS'!E204,\"INCOMPLETO RECHAZAR\")","v":"INCOMPLETO RECHAZAR"},704]
[{"$f":"+'NO SOCIOS'!A211","v":"l NO SOCIO"},{"$f":"+'NO SOCIOS'!B211","v":0},{"$f":"+'NO SOCIOS'!C211","v":0},{"$f":"+'NO SOCIOS'!D211","v":""},{"$f":"IF('NO SOCIOS'!E211>0,'NO SOCIOS'!E211,\"INCOMPLETO RECHAZAR\")","v":"INCOMPLETO RECHAZAR"},705]
[{"$f":"+'NO SOCIOS'!A215","v":"l NO SOCIO"},{"$f":"+'NO SOCIOS'!B215","v":0},{"$f":"+'NO SOCIOS'!C215","v":0},{"$f":"+'NO SOCIOS'!D215","v":"NOTA/OBSERVACIÓN -en mayúscula-:"},{"$f":"IF('NO SOCIOS'!E215>0,'NO SOCIOS'!E215,\"INCOMPLETO RECHAZAR\")","v":"INCOMPLETO RECHAZAR"},706]
[{"$f":"+'NO SOCIOS'!A205","v":"l NO SOCIO"},{"$f":"+'NO SOCIOS'!B205","v":0},{"$f":"+'NO SOCIOS'!C205","v":0},{"$f":"+'NO SOCIOS'!D205","v":"PROFESIÓN/OFICIO:"},{"$f":"IF('NO SOCIOS'!E205>0,'NO SOCIOS'!E205,\"INCOMPLETO RECHAZAR\")","v":"INCOMPLETO RECHAZAR"},707]
[{"$f":"+'NO SOCIOS'!A226","v":"l NO SOCIO"},{"$f":"+'NO SOCIOS'!B226","v":0},{"$f":"+'NO SOCIOS'!C226","v":0},{"$f":"+'NO SOCIOS'!D226","v":""},{"$f":"IF('NO SOCIOS'!E226>0,'NO SOCIOS'!E226,\"INCOMPLETO RECHAZAR\")","v":"INCOMPLETO RECHAZAR"},708]
[{"$f":"+'NO SOCIOS'!A223","v":"l NO SOCIO"},{"$f":"+'NO SOCIOS'!B223","v":0},{"$f":"+'NO SOCIOS'!C223","v":0},{"$f":"+'NO SOCIOS'!D223","v":"CEL/TEL :"},{"$f":"IF('NO SOCIOS'!E223>0,'NO SOCIOS'!E223,\"INCOMPLETO RECHAZAR\")","v":"INCOMPLETO RECHAZAR"},709]
[{"$f":"+'NO SOCIOS'!A217","v":"l NO SOCIO"},{"$f":"+'NO SOCIOS'!B217","v":0},{"$f":"+'NO SOCIOS'!C217","v":0},{"$f":"+'NO SOCIOS'!D217","v":"CUIT/CUIL –sin puntos ni barras-:"},{"$f":"IF('NO SOCIOS'!E217>0,'NO SOCIOS'!E217,\"INCOMPLETO RECHAZAR\")","v":"INCOMPLETO RECHAZAR"},710]
[{"$f":"+'NO SOCIOS'!A228","v":"l NO SOCIO"},{"$f":"+'NO SOCIOS'!B228","v":0},{"$f":"+'NO SOCIOS'!C228","v":0},{"$f":"+'NO SOCIOS'!D228","v":""},{"$f":"IF('NO SOCIOS'!E228>0,'NO SOCIOS'!E228,\"INCOMPLETO RECHAZAR\")","v":"INCOMPLETO RECHAZAR"},711]
[{"$f":"+'NO SOCIOS'!A216","v":"l NO SOCIO"},{"$f":"+'NO SOCIOS'!B216","v":0},{"$f":"+'NO SOCIOS'!C216","v":0},{"$f":"+'NO SOCIOS'!D216","v":"DOC. IDENTIDAD –sin puntos-:"},{"$f":"IF('NO SOCIOS'!E216>0,'NO SOCIOS'!E216,\"INCOMPLETO RECHAZAR\")","v":"INCOMPLETO RECHAZAR"},712]
[{"$f":"+'NO SOCIOS'!A222","v":"l NO SOCIO"},{"$f":"+'NO SOCIOS'!B222","v":0},{"$f":"+'NO SOCIOS'!C222","v":0},{"$f":"+'NO SOCIOS'!D222","v":"DOMICILIO REAL:"},{"$f":"IF('NO SOCIOS'!E222>0,'NO SOCIOS'!E222,\"INCOMPLETO RECHAZAR\")","v":"INCOMPLETO RECHAZAR"},713]
[{"$f":"+'NO SOCIOS'!A225","v":"l NO SOCIO"},{"$f":"+'NO SOCIOS'!B225","v":0},{"$f":"+'NO SOCIOS'!C225","v":0},{"$f":"+'NO SOCIOS'!D225","v":"ESTADO CIVIL:"},{"$f":"IF('NO SOCIOS'!E225>0,'NO SOCIOS'!E225,\"INCOMPLETO RECHAZAR\")","v":"INCOMPLETO RECHAZAR"},714]
[{"$f":"+'NO SOCIOS'!A218","v":"l NO SOCIO"},{"$f":"+'NO SOCIOS'!B218","v":0},{"$f":"+'NO SOCIOS'!C218","v":0},{"$f":"+'NO SOCIOS'!D218","v":"FECHA DE NACIMIENTO –dd/mm/aa-:"},{"$f":"IF('NO SOCIOS'!E218>0,'NO SOCIOS'!E218,\"INCOMPLETO RECHAZAR\")","v":"INCOMPLETO RECHAZAR"},715]
[{"$f":"+'NO SOCIOS'!A219","v":"l NO SOCIO"},{"$f":"+'NO SOCIOS'!B219","v":0},{"$f":"+'NO SOCIOS'!C219","v":0},{"$f":"+'NO SOCIOS'!D219","v":"LUGAR DE NACIMIENTO:"},{"$f":"IF('NO SOCIOS'!E219>0,'NO SOCIOS'!E219,\"INCOMPLETO RECHAZAR\")","v":"INCOMPLETO RECHAZAR"},716]
[{"$f":"+'NO SOCIOS'!A220","v":"l NO SOCIO"},{"$f":"+'NO SOCIOS'!B220","v":0},{"$f":"+'NO SOCIOS'!C220","v":0},{"$f":"+'NO SOCIOS'!D220","v":"NACIONALIDAD:"},{"$f":"IF('NO SOCIOS'!E220>0,'NO SOCIOS'!E220,\"INCOMPLETO RECHAZAR\")","v":"INCOMPLETO RECHAZAR"},717]
[{"$f":"+'NO SOCIOS'!A227","v":"l NO SOCIO"},{"$f":"+'NO SOCIOS'!B227","v":0},{"$f":"+'NO SOCIOS'!C227","v":0},{"$f":"+'NO SOCIOS'!D227","v":""},{"$f":"IF('NO SOCIOS'!E227>0,'NO SOCIOS'!E227,\"INCOMPLETO RECHAZAR\")","v":"INCOMPLETO RECHAZAR"},718]
[{"$f":"+'NO SOCIOS'!A231","v":"l NO SOCIO"},{"$f":"+'NO SOCIOS'!B231","v":0},{"$f":"+'NO SOCIOS'!C231","v":0},{"$f":"+'NO SOCIOS'!D231","v":"NOTA/OBSERVACIÓN -en mayúscula-:"},{"$f":"IF('NO SOCIOS'!E231>0,'NO SOCIOS'!E231,\"INCOMPLETO RECHAZAR\")","v":"INCOMPLETO RECHAZAR"},719]
[{"$f":"+'NO SOCIOS'!A221","v":"l NO SOCIO"},{"$f":"+'NO SOCIOS'!B221","v":0},{"$f":"+'NO SOCIOS'!C221","v":0},{"$f":"+'NO SOCIOS'!D221","v":"PROFESIÓN/OFICIO:"},{"$f":"IF('NO SOCIOS'!E221>0,'NO SOCIOS'!E221,\"INCOMPLETO RECHAZAR\")","v":"INCOMPLETO RECHAZAR"},720]
[{"$f":"+'NO SOCIOS'!A242","v":"l NO SOCIO"},{"$f":"+'NO SOCIOS'!B242","v":0},{"$f":"+'NO SOCIOS'!C242","v":0},{"$f":"+'NO SOCIOS'!D242","v":""},{"$f":"IF('NO SOCIOS'!E242>0,'NO SOCIOS'!E242,\"INCOMPLETO RECHAZAR\")","v":"INCOMPLETO RECHAZAR"},721]
[{"$f":"+'NO SOCIOS'!A239","v":"l NO SOCIO"},{"$f":"+'NO SOCIOS'!B239","v":0},{"$f":"+'NO SOCIOS'!C239","v":0},{"$f":"+'NO SOCIOS'!D239","v":"CEL/TEL :"},{"$f":"IF('NO SOCIOS'!E239>0,'NO SOCIOS'!E239,\"INCOMPLETO RECHAZAR\")","v":"INCOMPLETO RECHAZAR"},722]
[{"$f":"+'NO SOCIOS'!A233","v":"l NO SOCIO"},{"$f":"+'NO SOCIOS'!B233","v":0},{"$f":"+'NO SOCIOS'!C233","v":0},{"$f":"+'NO SOCIOS'!D233","v":"CUIT/CUIL –sin puntos ni barras-:"},{"$f":"IF('NO SOCIOS'!E233>0,'NO SOCIOS'!E233,\"INCOMPLETO RECHAZAR\")","v":"INCOMPLETO RECHAZAR"},723]
[{"$f":"+'NO SOCIOS'!A244","v":"l NO SOCIO"},{"$f":"+'NO SOCIOS'!B244","v":0},{"$f":"+'NO SOCIOS'!C244","v":0},{"$f":"+'NO SOCIOS'!D244","v":""},{"$f":"IF('NO SOCIOS'!E244>0,'NO SOCIOS'!E244,\"INCOMPLETO RECHAZAR\")","v":"INCOMPLETO RECHAZAR"},724]
[{"$f":"+'NO SOCIOS'!A232","v":"l NO SOCIO"},{"$f":"+'NO SOCIOS'!B232","v":0},{"$f":"+'NO SOCIOS'!C232","v":0},{"$f":"+'NO SOCIOS'!D232","v":"DOC. IDENTIDAD –sin puntos-:"},{"$f":"IF('NO SOCIOS'!E232>0,'NO SOCIOS'!E232,\"INCOMPLETO RECHAZAR\")","v":"INCOMPLETO RECHAZAR"},725]
[{"$f":"+'NO SOCIOS'!A238","v":"l NO SOCIO"},{"$f":"+'NO SOCIOS'!B238","v":0},{"$f":"+'NO SOCIOS'!C238","v":0},{"$f":"+'NO SOCIOS'!D238","v":"DOMICILIO REAL:"},{"$f":"IF('NO SOCIOS'!E238>0,'NO SOCIOS'!E238,\"INCOMPLETO RECHAZAR\")","v":"INCOMPLETO RECHAZAR"},726]
[{"$f":"+'NO SOCIOS'!A241","v":"l NO SOCIO"},{"$f":"+'NO SOCIOS'!B241","v":0},{"$f":"+'NO SOCIOS'!C241","v":0},{"$f":"+'NO SOCIOS'!D241","v":"ESTADO CIVIL:"},{"$f":"IF('NO SOCIOS'!E241>0,'NO SOCIOS'!E241,\"INCOMPLETO RECHAZAR\")","v":"INCOMPLETO RECHAZAR"},727]
[{"$f":"+'NO SOCIOS'!A234","v":"l NO SOCIO"},{"$f":"+'NO SOCIOS'!B234","v":0},{"$f":"+'NO SOCIOS'!C234","v":0},{"$f":"+'NO SOCIOS'!D234","v":"FECHA DE NACIMIENTO –dd/mm/aa-:"},{"$f":"IF('NO SOCIOS'!E234>0,'NO SOCIOS'!E234,\"INCOMPLETO RECHAZAR\")","v":"INCOMPLETO RECHAZAR"},728]
[{"$f":"+'NO SOCIOS'!A235","v":"l NO SOCIO"},{"$f":"+'NO SOCIOS'!B235","v":0},{"$f":"+'NO SOCIOS'!C235","v":0},{"$f":"+'NO SOCIOS'!D235","v":"LUGAR DE NACIMIENTO:"},{"$f":"IF('NO SOCIOS'!E235>0,'NO SOCIOS'!E235,\"INCOMPLETO RECHAZAR\")","v":"INCOMPLETO RECHAZAR"},729]
[{"$f":"+'NO SOCIOS'!A236","v":"l NO SOCIO"},{"$f":"+'NO SOCIOS'!B236","v":0},{"$f":"+'NO SOCIOS'!C236","v":0},{"$f":"+'NO SOCIOS'!D236","v":"NACIONALIDAD:"},{"$f":"IF('NO SOCIOS'!E236>0,'NO SOCIOS'!E236,\"INCOMPLETO RECHAZAR\")","v":"INCOMPLETO RECHAZAR"},730]
[{"$f":"+'NO SOCIOS'!A243","v":"l NO SOCIO"},{"$f":"+'NO SOCIOS'!B243","v":0},{"$f":"+'NO SOCIOS'!C243","v":0},{"$f":"+'NO SOCIOS'!D243","v":""},{"$f":"IF('NO SOCIOS'!E243>0,'NO SOCIOS'!E243,\"INCOMPLETO RECHAZAR\")","v":"INCOMPLETO RECHAZAR"},731]
[{"$f":"+'NO SOCIOS'!A247","v":"l NO SOCIO"},{"$f":"+'NO SOCIOS'!B247","v":0},{"$f":"+'NO SOCIOS'!C247","v":0},{"$f":"+'NO SOCIOS'!D247","v":"NOTA/OBSERVACIÓN -en mayúscula-:"},{"$f":"IF('NO SOCIOS'!E247>0,'NO SOCIOS'!E247,\"INCOMPLETO RECHAZAR\")","v":"INCOMPLETO RECHAZAR"},732]
[{"$f":"+'NO SOCIOS'!A237","v":"l NO SOCIO"},{"$f":"+'NO SOCIOS'!B237","v":0},{"$f":"+'NO SOCIOS'!C237","v":0},{"$f":"+'NO SOCIOS'!D237","v":"PROFESIÓN/OFICIO:"},{"$f":"IF('NO SOCIOS'!E237>0,'NO SOCIOS'!E237,\"INCOMPLETO RECHAZAR\")","v":"INCOMPLETO RECHAZAR"},733]
["za",{"$f":"'SOLICITUD-DATOS SOC'!$D$4","v":0},{"$f":"'SOLICITUD-DATOS SOC'!$D$4","v":0},"RESUMEN"]
["zb",{"$f":"'SOLICITUD-DATOS SOC'!$D$4","v":0},{"$f":"'SOLICITUD-DATOS SOC'!$D$4","v":0},{"$f":"+IF(AND(PREGUNTAS!A16=\"\",PREGUNTAS!A17=\"\",PREGUNTAS!A18=\"\"),\"\",IF(IMPRIMIR!E741=\"\",\"SE DEBE ACOMPAÑAR FDS\",\"INCONSISTENCIA/S VER SOLAPA PREGUNTAS\"))","v":""},{"$f":"IF(AND(PREGUNTAS!C2=\"\",PREGUNTAS!C3=\"\",PREGUNTAS!C4=\"\",PREGUNTAS!C8=\"\",PREGUNTAS!C9=\"\",PREGUNTAS!D12=\"\",PREGUNTAS!D13=\"\",PREGUNTAS!D14=\"\"),\"\",\"HAY INCONSISTENCIA/S VER SOLAPA PREGUNTAS\")","v":"HAY INCONSISTENCIA/S VER SOLAPA PREGUNTAS"}]
[{"$f":"IF(PREGUNTAS!C2=\"\",\"zc\",\"zc ERROR VER SOLAPA PREGUNTAS\")","v":"zc"},{"$f":"'SOLICITUD-DATOS SOC'!$D$4","v":0},{"$f":"'SOLICITUD-DATOS SOC'!$D$4","v":0},"TOTAL DE SOCIOS PERS HUMANAS CONSIGNADOS EN ESTE FORM:",{"$f":"+PREGUNTAS!B2","v":0}]
[{"$f":"IF(PREGUNTAS!C3=\"\",\"zd\",\"zd ERROR VER SOLAPA PREGUNTAS\")","v":"zd"},{"$f":"'SOLICITUD-DATOS SOC'!$D$4","v":0},{"$f":"'SOLICITUD-DATOS SOC'!$D$4","v":0},"TOTAL DE SOCIOS PERS JURIDICA CONSIGNADOS EN ESTE FORM:",{"$f":"+PREGUNTAS!B3","v":0}]
[{"$f":"IF(E744<1,\"ze NO TIENE SOCIOS\",\"ze\")","v":"ze NO TIENE SOCIOS"},{"$f":"'SOLICITUD-DATOS SOC'!$D$4","v":0},{"$f":"'SOLICITUD-DATOS SOC'!$D$4","v":0},"TOTAL DE SOCIOS EN ESTE FORM:",{"$f":"+LISTADOS!C63","v":0}]
["zf",{"$f":"'SOLICITUD-DATOS SOC'!$D$4","v":0},{"$f":"'SOLICITUD-DATOS SOC'!$D$4","v":0},"TOTAL NO SOCIOS INTEGRANTES DE ORGANO REP. LEGAL/ ADMINISTRATIVO EN ESTE FORM:",{"$f":"+PREGUNTAS!B4","v":0}]
[{"$f":"IF(OR(PREGUNTAS!A16=\"POR SOCIOS HUMANOS SUPERIORES A 14, LLENAR FDS-SOCIOS Y NO SOCIOS ADICIONALES\",PREGUNTAS!A17=\"POR SOCIOS PER. JURÍDICAS SUPERIORES A 10, LLENAR FDS-SOCIOS Y NO SOCIOS ADICIONALES\"),\"zg\",IF(E746='SOLICITUD-DATOS SOC'!E32,\"zg\",\"zg SUMA DE SUSCRIPCIONES NO ES IGUAL AL CAP. SOCIAL\"))","v":"zg"},{"$f":"'SOLICITUD-DATOS SOC'!$D$4","v":0},{"$f":"'SOLICITUD-DATOS SOC'!$D$4","v":0},"SUMA DE CAPITAL SUCRIPTO POR SOCIOS DEL FORMULARIO:",{"$f":"SOCIOS!E32+SOCIOS!E54+SOCIOS!E76+SOCIOS!E98+SOCIOS!E120+SOCIOS!E142+SOCIOS!E164+SOCIOS!E186+SOCIOS!E208+SOCIOS!E230+SOCIOS!E252+SOCIOS!E274+SOCIOS!E296+SOCIOS!E318+SOCIOS!J29+SOCIOS!J46+SOCIOS!J63+SOCIOS!J80+SOCIOS!J97+SOCIOS!J114+SOCIOS!J131+SOCIOS!J148+SOCIOS!J165+SOCIOS!J182","v":0}]
["zh",{"$f":"'SOLICITUD-DATOS SOC'!$D$4","v":0},{"$f":"'SOLICITUD-DATOS SOC'!$D$4","v":0},"SUMA DE CAPITAL INTEGRADO POR SOCIOS DEL FORMULARIO:",{"$f":"SOCIOS!E33+SOCIOS!E55+SOCIOS!E77+SOCIOS!E99+SOCIOS!E121+SOCIOS!E143+SOCIOS!E165+SOCIOS!E187+SOCIOS!E209+SOCIOS!E231+SOCIOS!E253+SOCIOS!E275+SOCIOS!E297+SOCIOS!E319+SOCIOS!J30+SOCIOS!J47+SOCIOS!J64+SOCIOS!J81+SOCIOS!J98+SOCIOS!J115+SOCIOS!J132+SOCIOS!J149+SOCIOS!J166+SOCIOS!J183","v":0}]
[{"$f":"IF(OR(PREGUNTAS!A16=\"POR SOCIOS HUMANOS SUPERIORES A 14, LLENAR FDS-SOCIOS Y NO SOCIOS ADICIONALES\",PREGUNTAS!A17=\"POR SOCIOS PER. JURÍDICAS SUPERIORES A 10, LLENAR FDS-SOCIOS Y NO SOCIOS ADICIONALES\"),\"zi\",IF(E748='SOLICITUD-DATOS SOC'!E34,\"zi\",\"zi SUMA DE SUSCRIPCIONES NO ES IGUAL AL CAP. SOCIAL\"))","v":"zi"},{"$f":"'SOLICITUD-DATOS SOC'!$D$4","v":0},{"$f":"'SOLICITUD-DATOS SOC'!$D$4","v":0},"SUMA DE ACCIONES SUSCRIPTA POR SOCIOS DEL FORMULARIO:",{"$f":"SOCIOS!E29+SOCIOS!E51+SOCIOS!E73+SOCIOS!E95+SOCIOS!E117+SOCIOS!E139+SOCIOS!E161+SOCIOS!E183+SOCIOS!E205+SOCIOS!E227+SOCIOS!E249+SOCIOS!E271+SOCIOS!E293+SOCIOS!E315+SOCIOS!J26+SOCIOS!J43+SOCIOS!J60+SOCIOS!J77+SOCIOS!J94+SOCIOS!J111+SOCIOS!J128+SOCIOS!J145+SOCIOS!J162+SOCIOS!J179","v":0}]
[null,{"$f":"'SOLICITUD-DATOS SOC'!$D$4","v":0},{"$f":"'SOLICITUD-DATOS SOC'!$D$4","v":0},"REFERENCIA: "]
[null,{"$f":"'SOLICITUD-DATOS SOC'!$D$4","v":0},{"$f":"'SOLICITUD-DATOS SOC'!$D$4","v":0},"a GESTOR: Quien inicia el trámite."]
[null,{"$f":"'SOLICITUD-DATOS SOC'!$D$4","v":0},{"$f":"'SOLICITUD-DATOS SOC'!$D$4","v":0},"b SOCIEDAD: Datos de la sociedad a inscribir."]
[null,{"$f":"'SOLICITUD-DATOS SOC'!$D$4","v":0},{"$f":"'SOLICITUD-DATOS SOC'!$D$4","v":0},"c SOCIO PH: Socio/a persona humana."]
[null,{"$f":"'SOLICITUD-DATOS SOC'!$D$4","v":0},{"$f":"'SOLICITUD-DATOS SOC'!$D$4","v":0},"c SOCIO PJ: Socio persona jurídica."]
[null,{"$f":"'SOLICITUD-DATOS SOC'!$D$4","v":0},{"$f":"'SOLICITUD-DATOS SOC'!$D$4","v":0},"d CANT. ACC. : Cantidad de acciones sucriptas."]
[null,{"$f":"'SOLICITUD-DATOS SOC'!$D$4","v":0},{"$f":"'SOLICITUD-DATOS SOC'!$D$4","v":0},"d CANT. ACC. TOT. : Total de acciones sucriptas."]
[null,{"$f":"'SOLICITUD-DATOS SOC'!$D$4","v":0},{"$f":"'SOLICITUD-DATOS SOC'!$D$4","v":0},"e CAP. SUSCR.: Capital Total Suscripto (Capital Social)."]
[null,{"$f":"'SOLICITUD-DATOS SOC'!$D$4","v":0},{"$f":"'SOLICITUD-DATOS SOC'!$D$4","v":0},"f PARTICIPACION: Porción de participación que tiene cada socio/a en el capital social."]
[null,{"$f":"'SOLICITUD-DATOS SOC'!$D$4","v":0},{"$f":"'SOLICITUD-DATOS SOC'!$D$4","v":0},"g AP. DINERO: Aportes en dinero del/los socio/a/s,"]
[null,{"$f":"'SOLICITUD-DATOS SOC'!$D$4","v":0},{"$f":"'SOLICITUD-DATOS SOC'!$D$4","v":0}]
[null,{"$f":"'SOLICITUD-DATOS SOC'!$D$4","v":0},{"$f":"'SOLICITUD-DATOS SOC'!$D$4","v":0},"h CAP. INTEG.: Capital mínimo a integrar al momento de la constitución por cada socio/a."]
[null,{"$f":"'SOLICITUD-DATOS SOC'!$D$4","v":0},{"$f":"'SOLICITUD-DATOS SOC'!$D$4","v":0},"h CAP. INTEG. TOT. FORM: Capital mínimo a integrar al momento de la constitución total de socios de este formulario."]
[null,{"$f":"'SOLICITUD-DATOS SOC'!$D$4","v":0},{"$f":"'SOLICITUD-DATOS SOC'!$D$4","v":0},"i ORG. REP. LEGAL/ ADM.: Miembro/s del órgano de representación/administración."]
[null,{"$f":"'SOLICITUD-DATOS SOC'!$D$4","v":0},{"$f":"'SOLICITUD-DATOS SOC'!$D$4","v":0},"j ORG. FISCALIZ.: Miembro/s del órgano de fiscalización."]
[null,{"$f":"'SOLICITUD-DATOS SOC'!$D$4","v":0},{"$f":"'SOLICITUD-DATOS SOC'!$D$4","v":0},"cn DATO ADIC: Datos adicionales."]
[null,{"$f":"'SOLICITUD-DATOS SOC'!$D$4","v":0},{"$f":"'SOLICITUD-DATOS SOC'!$D$4","v":0},"l NO SOCIO: Datos de las personas humanas NO socias que forman parte de los órganos de administración, fiscalización o son respresentante/s legal/es."]

{"sheet":"LISTADOS","index":6,"n_rows":74,"n_cols":7,"rows_kept":74,"cut":false,"hidden":true,"merged":[]}
["ESTADO CIVIL","ACTIVIDAD PRINCIPAL","ADMINISTRADOR SAS 1 socios","ADMINISTRADOR SAS 1 NO socios"]
["SOLTERO/A","COMERCIAL","SOCIO/A ADM. TITULAR","NO SOCIO/A ADM. TITULAR"]
["CASADO/A","INMOBILIARIA","SOCIO/A ADM. SUPLENTE","NO SOCIO/A ADM. SUPLENTE"]
["VIUDO/A","INDUSTRIAL"]
["DIVORCIADO/A","FINANCIERA",null,"SUMA ADM SUPLENTES SAS 1","SUMA ADM TITULAR SAS 1"]
[null,"TRANSPORTE",null,{"$f":"COUNTIFS(#REF!,\"*\"&\"SUPLENTE\"&\"*\")","v":{"$error":"#REF!"}},{"$f":"COUNTIFS(#REF!,\"*\"&\"TITULAR\"&\"*\")","v":{"$error":"#REF!"}}]
["GESTIONANTE","AGROPECUARIA",null,{"$f":"COUNTIFS(#REF!,\"*\"&\"SUPLENTE\"&\"*\")","v":{"$error":"#REF!"}},{"$f":"COUNTIFS(#REF!,\"*\"&\"TITULAR\"&\"*\")","v":{"$error":"#REF!"}}]
[null,"MINERA"]
["APODERADO/A LETRADO/A","EXTRACCIÓN PETROLEO Y/O GAS"]
["ESCRIBANO/A","CONSTRUCCIÓN"]
["AUTORIZADO/A","OTRA/S"]
["REP. LEGAL SOC."]
[]
["CUIT"]
["NO POSEE"]
["POSEE"]
["EN TRAMITE"]
[]
["ADMINISTRADOR","RESOLUCION 70/2011 -SOCIO",null,"PREGUNTAS","UIF SAS 1"]
[0,"SI",null,"SI","SI"]
["ADMINISTRADOR/A TITULAR","NO",null,"NO","NO"]
["ADMINISTRADOR/A SUPLENTE","ORG. FISCALIZACION"]
["PRESIDENTE/A",0,"ADMINISTRADOR NO SOCIO"]
["VICEPRESIDENTE/A","SINDICO/A",0]
["DIRECTOR/A","SINDICO/A SUPLENTE","ADMINISTRADOR/A TITULAR"]
["DIRECTOR/A SUPLENTE","AUDITOR/A","ADMINISTRADOR/A SUPLENTE"]
["SUBDIRECTOR/A","AUDITOR/A SUPLENTE","PRESIDENTE/A"]
["SUBDIRECTOR/A SUPLENTE","SUBAUDITOR/A","VICEPRESIDENTE/A"]
["SOCIO/A GERENTE","CONTRALOR/A","DIRECTOR/A"]
["SOCIO/A GERENTE SUPLENTE","CONTRALOR/A SUPLENTE","DIRECTOR/A SUPLENTE"]
["GERENTE/A","OTRO/A","SUBDIRECTOR/A"]
["GERENTE/A SUPLENTE",null,"SUBDIRECTOR/A SUPLENTE"]
["OTRO/A",null,"GERENTE/A"]
[null,null,"GERENTE/A SUPLENTE"]
[null,null,"OTRO/A"]
[]
[]
["CANTIDAD DE REP. LEGAL/ ADM TITULARES","CANTIDAD DE REP. LEGAL/ ADM SUPLENTES","CANTIDAD DE SOCIOS",null,null,"CANTIDAD DE NO SOCIOS"]
[{"$f":"+IF(SOCIOS!$E35=\"ADMINISTRADOR/A TITULAR\",1,0)","v":0},{"$f":"+IF(SOCIOS!$E35=\"ADMINISTRADOR/A SUPLENTE\",1,0)","v":0},{"$f":"IF(SOCIOS!B16=0,0,1)","v":0},null,null,{"$f":"IF('NO SOCIOS'!B8=0,0,1)","v":0}]
[{"$f":"+IF(SOCIOS!$E57=\"ADMINISTRADOR/A TITULAR\",1,0)","v":0},{"$f":"+IF(SOCIOS!$E57=\"ADMINISTRADOR/A SUPLENTE\",1,0)","v":0},{"$f":"IF(SOCIOS!B38=0,0,1)","v":0},null,null,{"$f":"IF('NO SOCIOS'!B24=0,0,1)","v":0}]
[{"$f":"+IF(SOCIOS!$E79=\"ADMINISTRADOR/A TITULAR\",1,0)","v":0},{"$f":"+IF(SOCIOS!$E79=\"ADMINISTRADOR/A SUPLENTE\",1,0)","v":0},{"$f":"IF(SOCIOS!B60=0,0,1)","v":0},null,null,{"$f":"IF('NO SOCIOS'!B40=0,0,1)","v":0}]
[{"$f":"+IF(SOCIOS!$E101=\"ADMINISTRADOR/A TITULAR\",1,0)","v":0},{"$f":"+IF(SOCIOS!$E101=\"ADMINISTRADOR/A SUPLENTE\",1,0)","v":0},{"$f":"IF(SOCIOS!B82=0,0,1)","v":0},null,null,{"$f":"IF('NO SOCIOS'!B56=0,0,1)","v":0}]
[{"$f":"+IF(SOCIOS!$E123=\"ADMINISTRADOR/A TITULAR\",1,0)","v":0},{"$f":"+IF(SOCIOS!$E123=\"ADMINISTRADOR/A SUPLENTE\",1,0)","v":0},{"$f":"IF(SOCIOS!B104=0,0,1)","v":0},null,null,{"$f":"IF('NO SOCIOS'!B72=0,0,1)","v":0}]
[{"$f":"+IF(SOCIOS!$E145=\"ADMINISTRADOR/A TITULAR\",1,0)","v":0},{"$f":"+IF(SOCIOS!$E145=\"ADMINISTRADOR/A SUPLENTE\",1,0)","v":0},{"$f":"IF(SOCIOS!B126=0,0,1)","v":0},null,null,{"$f":"IF('NO SOCIOS'!B88=0,0,1)","v":0}]
[{"$f":"+IF(SOCIOS!$E167=\"ADMINISTRADOR/A TITULAR\",1,0)","v":0},{"$f":"+IF(SOCIOS!$E167=\"ADMINISTRADOR/A SUPLENTE\",1,0)","v":0},{"$f":"IF(SOCIOS!B148=0,0,1)","v":0},null,null,{"$f":"IF('NO SOCIOS'!B104=0,0,1)","v":0}]
[{"$f":"+IF(SOCIOS!$E189=\"ADMINISTRADOR/A TITULAR\",1,0)","v":0},{"$f":"+IF(SOCIOS!$E189=\"ADMINISTRADOR/A SUPLENTE\",1,0)","v":0},{"$f":"IF(SOCIOS!B170=0,0,1)","v":0},null,null,{"$f":"IF('NO SOCIOS'!B120=0,0,1)","v":0}]
[{"$f":"+IF(SOCIOS!$E211=\"ADMINISTRADOR/A TITULAR\",1,0)","v":0},{"$f":"+IF(SOCIOS!$E211=\"ADMINISTRADOR/A SUPLENTE\",1,0)","v":0},{"$f":"IF(SOCIOS!B192=0,0,1)","v":0},null,null,{"$f":"IF('NO SOCIOS'!B136=0,0,1)","v":0}]
[{"$f":"+IF(SOCIOS!$E233=\"ADMINISTRADOR/A TITULAR\",1,0)","v":0},{"$f":"+IF(SOCIOS!$E233=\"ADMINISTRADOR/A SUPLENTE\",1,0)","v":0},{"$f":"IF(SOCIOS!B214=0,0,1)","v":0},null,null,{"$f":"IF('NO SOCIOS'!B152=0,0,1)","v":0}]
[{"$f":"+IF(SOCIOS!$E255=\"ADMINISTRADOR/A TITULAR\",1,0)","v":0},{"$f":"+IF(SOCIOS!$E255=\"ADMINISTRADOR/A SUPLENTE\",1,0)","v":0},{"$f":"IF(SOCIOS!B236=0,0,1)","v":0},null,null,{"$f":"IF('NO SOCIOS'!B168=0,0,1)","v":0}]
[{"$f":"+IF(SOCIOS!$E277=\"ADMINISTRADOR/A TITULAR\",1,0)","v":0},{"$f":"+IF(SOCIOS!$E277=\"ADMINISTRADOR/A SUPLENTE\",1,0)","v":0},{"$f":"IF(SOCIOS!B258=0,0,1)","v":0},null,null,{"$f":"IF('NO SOCIOS'!B184=0,0,1)","v":0}]
[{"$f":"+IF(SOCIOS!$E299=\"ADMINISTRADOR/A TITULAR\",1,0)","v":0},{"$f":"+IF(SOCIOS!$E299=\"ADMINISTRADOR/A SUPLENTE\",1,0)","v":0},{"$f":"IF(SOCIOS!B280=0,0,1)","v":0},null,null,{"$f":"IF('NO SOCIOS'!B200=0,0,1)","v":0}]
[{"$f":"+IF(SOCIOS!$E321=\"ADMINISTRADOR/A TITULAR\",1,0)","v":0},{"$f":"+IF(SOCIOS!$E321=\"ADMINISTRADOR/A SUPLENTE\",1,0)","v":0},{"$f":"IF(SOCIOS!B302=0,0,1)","v":0},{"$f":"+SUM(C39:C52)","v":0},"TOTAL SOCIOS PH",{"$f":"IF('NO SOCIOS'!B216=0,0,1)","v":0}]
[{"$f":"+IF('NO SOCIOS'!$E21=\"ADMINISTRADOR/A TITULAR\",1,0)","v":0},{"$f":"+IF('NO SOCIOS'!$E21=\"ADMINISTRADOR/A SUPLENTE\",1,0)","v":0},{"$f":"IF(SOCIOS!H16=0,0,1)","v":0},null,null,{"$f":"IF('NO SOCIOS'!B232=0,0,1)","v":0}]
[{"$f":"+IF('NO SOCIOS'!$E22=\"ADMINISTRADOR/A TITULAR\",1,0)","v":0},{"$f":"+IF('NO SOCIOS'!$E22=\"ADMINISTRADOR/A SUPLENTE\",1,0)","v":0},{"$f":"IF(SOCIOS!H33=0,0,1)","v":0},null,{"$f":"SOCIOS!E33+SOCIOS!E55+SOCIOS!E77+SOCIOS!E99+SOCIOS!E121+SOCIOS!E143+SOCIOS!E165+SOCIOS!E187+SOCIOS!E209+SOCIOS!E231+SOCIOS!E253+SOCIOS!E275+SOCIOS!E297+SOCIOS!E319+SOCIOS!J30+SOCIOS!J47+SOCIOS!J64+SOCIOS!J81+SOCIOS!J98+SOCIOS!J115+SOCIOS!J132+SOCIOS!J149+SOCIOS!J166+SOCIOS!J183","v":0},{"$f":"SUM(F39:F53)","v":0},"TOTAL NO SOCIOS"]
[{"$f":"+IF('NO SOCIOS'!$E53=\"ADMINISTRADOR/A TITULAR\",1,0)","v":0},{"$f":"+IF('NO SOCIOS'!$E53=\"ADMINISTRADOR/A SUPLENTE\",1,0)","v":0},{"$f":"IF(SOCIOS!H50=0,0,1)","v":0}]
[{"$f":"+IF('NO SOCIOS'!$E69=\"ADMINISTRADOR/A TITULAR\",1,0)","v":0},{"$f":"+IF('NO SOCIOS'!$E69=\"ADMINISTRADOR/A SUPLENTE\",1,0)","v":0},{"$f":"IF(SOCIOS!H67=0,0,1)","v":0}]
[{"$f":"+IF('NO SOCIOS'!E85=\"ADMINISTRADOR/A TITULAR\",1,0)","v":0},{"$f":"+IF('NO SOCIOS'!F85=\"ADMINISTRADOR/A SUPLENTE\",1,0)","v":0},{"$f":"IF(SOCIOS!H84=0,0,1)","v":0}]
[{"$f":"+IF('NO SOCIOS'!E101=\"ADMINISTRADOR/A TITULAR\",1,0)","v":0},{"$f":"+IF('NO SOCIOS'!F101=\"ADMINISTRADOR/A SUPLENTE\",1,0)","v":0},{"$f":"IF(SOCIOS!H101=0,0,1)","v":0}]
[{"$f":"+IF('NO SOCIOS'!E117=\"ADMINISTRADOR/A TITULAR\",1,0)","v":0},{"$f":"+IF('NO SOCIOS'!F117=\"ADMINISTRADOR/A SUPLENTE\",1,0)","v":0},{"$f":"IF(SOCIOS!H118=0,0,1)","v":0}]
[{"$f":"+IF('NO SOCIOS'!E133=\"ADMINISTRADOR/A TITULAR\",1,0)","v":0},{"$f":"+IF('NO SOCIOS'!F133=\"ADMINISTRADOR/A SUPLENTE\",1,0)","v":0},{"$f":"IF(SOCIOS!H135=0,0,1)","v":0}]
[{"$f":"+IF('NO SOCIOS'!E149=\"ADMINISTRADOR/A TITULAR\",1,0)","v":0},{"$f":"+IF('NO SOCIOS'!F149=\"ADMINISTRADOR/A SUPLENTE\",1,0)","v":0},{"$f":"IF(SOCIOS!H152=0,0,1)","v":0}]
[{"$f":"+IF('NO SOCIOS'!E165=\"ADMINISTRADOR/A TITULAR\",1,0)","v":0},{"$f":"+IF('NO SOCIOS'!F165=\"ADMINISTRADOR/A SUPLENTE\",1,0)","v":0},{"$f":"IF(SOCIOS!H169=0,0,1)","v":0},{"$f":"+SUM(C53:C62)","v":0},"TOTAL SOCIOS PJ"]
[{"$f":"+IF('NO SOCIOS'!E181=\"ADMINISTRADOR/A TITULAR\",1,0)","v":0},{"$f":"+IF('NO SOCIOS'!F181=\"ADMINISTRADOR/A SUPLENTE\",1,0)","v":0},{"$f":"SUM(C39:C62)","v":0},"TOTAL SOCIOS"]
[{"$f":"+IF('NO SOCIOS'!E197=\"ADMINISTRADOR/A TITULAR\",1,0)","v":0},{"$f":"+IF('NO SOCIOS'!F197=\"ADMINISTRADOR/A SUPLENTE\",1,0)","v":0}]
[{"$f":"+IF('NO SOCIOS'!E213=\"ADMINISTRADOR/A TITULAR\",1,0)","v":0},{"$f":"+IF('NO SOCIOS'!F213=\"ADMINISTRADOR/A SUPLENTE\",1,0)","v":0}]
[{"$f":"+IF('NO SOCIOS'!E229=\"ADMINISTRADOR/A TITULAR\",1,0)","v":0},{"$f":"+IF('NO SOCIOS'!F229=\"ADMINISTRADOR/A SUPLENTE\",1,0)","v":0}]
[{"$f":"+IF('NO SOCIOS'!E245=\"ADMINISTRADOR/A TITULAR\",1,0)","v":0},{"$f":"+IF('NO SOCIOS'!F245=\"ADMINISTRADOR/A SUPLENTE\",1,0)","v":0}]
[{"$f":"SUM(A39:A67)","v":0},{"$f":"SUM(B39:B67)","v":0},"TOTALES"]
[]
[]
["TRAMITES"]
["ELEGIR"]
["INSCRIPCIÓN INICIAL"]
["MODIFICACION/ES"]

{"sheet":"BD-GRAL","index":7,"n_rows":738,"n_cols":18,"rows_kept":738,"cut":false,"hidden":true,"merged":[[4,0,5,0],[4,1,5,1],[4,2,4,3],[4,4,5,4],[4,5,5,5],[1,7,1,8],[2,7,2,8],[3,4,3,5],[3,7,3,8],[4,13,4,17],[4,6,4,7],[4,8,5,8],[4,9,5,9],[4,10,5,10],[4,11,5,11],[4,12,5,12]]}
["BASE DE DATOS"]
["FECHA DE CARGA BASE DATOS:",null,null,null,null,null,null,{"$f":"+IF(G2>0,\".\",\"ERROR llene FECHA\")","v":"ERROR llene FECHA"}]
["EXPTE. NRO. DONDE SE DENUNCIÓ DATOS:",null,null,null,null,null,null,{"$f":"+IF(G3>0,\".\",\"ERROR llene NRO. EXPTE.\")","v":"ERROR llene NRO. EXPTE."}]
[null,null,null,null,"NRO. DE LEGAJO",null,null,{"$f":"+IF(G4>0,\".\",\"ERROR llene NRO. LEGAJO\")","v":"ERROR llene NRO. LEGAJO"}]
["COD. Int.","FORM.","DATOS DENUNCIADOS",null,"VINCULADOS","VINCULADOS","DATOS",null,"FECHA","NRO. DE LEGAJO","EXPTE./OTROS","FS.","NOTA/ OTROS","OBSERVACION"]
[null,null,"INSCRIPTO RPC","FECHA ALTA/MO-DIFICACIÓN",null,null,"CONCEPTO","COMPLETAR -EN MAYUSCULA -",null,null,null,null,null,"FECHA","DETALLE","EXPTE./ OTRO/s","FS.","NOTA/ OTROS"]
[]
[null,{"$f":"IF(E8=0,0,IMPRIMIR!A7)","v":0},{"$f":"IF(E8=0,0,IMPRIMIR!$D$3)","v":0},{"$f":"IF(E8=\"0\",0,$G$2)","v":0},{"$f":"IMPRIMIR!B7","v":0},{"$f":"IMPRIMIR!C7","v":0},{"$f":"IF(E8=0,0,IMPRIMIR!D7)","v":0},{"$f":"IF(E8=0,0,IMPRIMIR!E7)","v":0},{"$f":"IF(E8=0,0,$G$2)","v":0},{"$f":"IF(E8=0,0,$G$4)","v":0},{"$f":"IF(E8=0,0,$G$3)","v":0}]
[null,{"$f":"IF(E9=0,0,IMPRIMIR!A8)","v":0},{"$f":"IF(E9=0,0,IMPRIMIR!$D$3)","v":0},{"$f":"IF(E9=\"0\",0,$G$2)","v":0},{"$f":"IMPRIMIR!B8","v":0},{"$f":"IMPRIMIR!C8","v":0},{"$f":"IF(E9=0,0,IMPRIMIR!D8)","v":0},{"$f":"IF(E9=0,0,IMPRIMIR!E8)","v":0},{"$f":"IF(E9=0,0,$G$2)","v":0},{"$f":"IF(E9=0,0,$G$4)","v":0},{"$f":"IF(E9=0,0,$G$3)","v":0}]
[null,{"$f":"IF(E10=0,0,IMPRIMIR!A9)","v":0},{"$f":"IF(E10=0,0,IMPRIMIR!$D$3)","v":0},0,{"$f":"IMPRIMIR!B9","v":0},{"$f":"IMPRIMIR!C9","v":0},{"$f":"IF(E10=0,0,IMPRIMIR!D9)","v":0},{"$f":"IF(E10=0,0,IMPRIMIR!E9)","v":0},0,0,0]
[null,{"$f":"IF(E11=0,0,IMPRIMIR!A10)","v":0},{"$f":"IF(E11=0,0,IMPRIMIR!$D$3)","v":0},0,{"$f":"IMPRIMIR!B10","v":0},{"$f":"IMPRIMIR!C10","v":0},{"$f":"IF(E11=0,0,IMPRIMIR!D10)","v":0},{"$f":"IF(E11=0,0,IMPRIMIR!E10)","v":0},0,0,0]
[null,{"$f":"IF(E12=0,0,IMPRIMIR!A11)","v":0},{"$f":"IF(E12=0,0,IMPRIMIR!$D$3)","v":0},0,{"$f":"IMPRIMIR!B11","v":0},{"$f":"IMPRIMIR!C11","v":0},{"$f":"IF(E12=0,0,IMPRIMIR!D11)","v":0},{"$f":"IF(E12=0,0,IMPRIMIR!E11)","v":0},0,0,0]
[null,{"$f":"IF(E13=0,0,IMPRIMIR!A12)","v":0},{"$f":"IF(E13=0,0,IMPRIMIR!$D$3)","v":0},0,{"$f":"IMPRIMIR!B12","v":0},{"$f":"IMPRIMIR!C12","v":0},{"$f":"IF(E13=0,0,IMPRIMIR!D12)","v":0},{"$f":"IF(E13=0,0,IMPRIMIR!E12)","v":0},0,0,0]
[null,{"$f":"IF(E14=0,0,IMPRIMIR!A13)","v":0},{"$f":"IF(E14=0,0,IMPRIMIR!$D$3)","v":0},0,{"$f":"IMPRIMIR!B13","v":0},{"$f":"IMPRIMIR!C13","v":0},{"$f":"IF(E14=0,0,IMPRIMIR!D13)","v":0},{"$f":"IF(E14=0,0,IMPRIMIR!E13)","v":0},0,0,0]
[null,{"$f":"IF(E15=0,0,IMPRIMIR!A14)","v":0},{"$f":"IF(E15=0,0,IMPRIMIR!$D$3)","v":0},0,{"$f":"IMPRIMIR!B14","v":0},{"$f":"IMPRIMIR!C14","v":0},{"$f":"IF(E15=0,0,IMPRIMIR!D14)","v":0},{"$f":"IF(E15=0,0,IMPRIMIR!E14)","v":0},0,0,0]
[null,{"$f":"IF(E16=0,0,IMPRIMIR!A15)","v":"b SOCIEDAD"},{"$f":"IF(E16=0,0,IMPRIMIR!$D$3)","v":0},0,{"$f":"IMPRIMIR!B15","v":"0"},{"$f":"IMPRIMIR!C15","v":"0"},{"$f":"IF(E16=0,0,IMPRIMIR!D15)","v":"CEL/TEL (de administración) -en su caso indicar que no posee-:"},{"$f":"IF(E16=0,0,IMPRIMIR!E15)","v":"INCOMPLETO RECHAZAR"},0,0,0]
[null,{"$f":"IF(E17=0,0,IMPRIMIR!A16)","v":"b SOCIEDAD"},{"$f":"IF(E17=0,0,IMPRIMIR!$D$3)","v":0},0,{"$f":"IMPRIMIR!B16","v":"0"},{"$f":"IMPRIMIR!C16","v":"0"},{"$f":"IF(E17=0,0,IMPRIMIR!D16)","v":"EMAIL (de administración)  -en su caso indicar que no posee-:"},{"$f":"IF(E17=0,0,IMPRIMIR!E16)","v":"INCOMPLETO RECHAZAR"},0,0,0]
[null,{"$f":"IF(E18=0,0,IMPRIMIR!A17)","v":"ba SOCIEDAD"},{"$f":"IF(E18=0,0,IMPRIMIR!$D$3)","v":0},0,{"$f":"IMPRIMIR!B17","v":"0"},{"$f":"IMPRIMIR!C17","v":"0"},{"$f":"IF(E18=0,0,IMPRIMIR!D17)","v":"DIRECCION SEDE SOCIAL:"},{"$f":"IF(E18=0,0,IMPRIMIR!E17)","v":"INCOMPLETO RECHAZAR"},0,0,0]
[null,{"$f":"IF(E19=0,0,IMPRIMIR!A18)","v":"bb SOCIEDAD"},{"$f":"IF(E19=0,0,IMPRIMIR!$D$3)","v":0},0,{"$f":"IMPRIMIR!B18","v":"0"},{"$f":"IMPRIMIR!C18","v":"0"},{"$f":"IF(E19=0,0,IMPRIMIR!D18)","v":"CUIT –sin puntos ni barras-:"},{"$f":"IF(E19=0,0,IMPRIMIR!E18)","v":"INCOMPLETO RECHAZAR"},0,0,0]
[null,{"$f":"IF(E20=0,0,IMPRIMIR!A19)","v":0},{"$f":"IF(E20=0,0,IMPRIMIR!$D$3)","v":0},0,{"$f":"IMPRIMIR!B19","v":0},{"$f":"IMPRIMIR!C19","v":0},{"$f":"IF(E20=0,0,IMPRIMIR!D19)","v":0},{"$f":"IF(E20=0,0,IMPRIMIR!E19)","v":0},0,0,0]
[null,{"$f":"IF(E21=0,0,IMPRIMIR!A20)","v":0},{"$f":"IF(E21=0,0,IMPRIMIR!$D$3)","v":0},0,{"$f":"IMPRIMIR!B20","v":0},{"$f":"IMPRIMIR!C20","v":0},{"$f":"IF(E21=0,0,IMPRIMIR!D20)","v":0},{"$f":"IF(E21=0,0,IMPRIMIR!E20)","v":0},0,0,0]
[null,{"$f":"IF(E22=0,0,IMPRIMIR!A21)","v":0},{"$f":"IF(E22=0,0,IMPRIMIR!$D$3)","v":0},0,{"$f":"IMPRIMIR!B21","v":0},{"$f":"IMPRIMIR!C21","v":0},{"$f":"IF(E22=0,0,IMPRIMIR!D21)","v":0},{"$f":"IF(E22=0,0,IMPRIMIR!E21)","v":0},0,0,0]
[null,{"$f":"IF(E23=0,0,IMPRIMIR!A22)","v":0},{"$f":"IF(E23=0,0,IMPRIMIR!$D$3)","v":0},0,{"$f":"IMPRIMIR!B22","v":0},{"$f":"IMPRIMIR!C22","v":0},{"$f":"IF(E23=0,0,IMPRIMIR!D22)","v":0},{"$f":"IF(E23=0,0,IMPRIMIR!E22)","v":0},0,0,0]
[null,{"$f":"IF(E24=0,0,IMPRIMIR!A23)","v":0},{"$f":"IF(E24=0,0,IMPRIMIR!$D$3)","v":0},0,{"$f":"IMPRIMIR!B23","v":0},{"$f":"IMPRIMIR!C23","v":0},{"$f":"IF(E24=0,0,IMPRIMIR!D23)","v":0},{"$f":"IF(E24=0,0,IMPRIMIR!E23)","v":0},0,0,0]
[null,{"$f":"IF(E25=0,0,IMPRIMIR!A24)","v":0},{"$f":"IF(E25=0,0,IMPRIMIR!$D$3)","v":0},0,{"$f":"IMPRIMIR!B24","v":0},{"$f":"IMPRIMIR!C24","v":0},{"$f":"IF(E25=0,0,IMPRIMIR!D24)","v":0},{"$f":"IF(E25=0,0,IMPRIMIR!E24)","v":0},0,0,0]
[null,{"$f":"IF(E26=0,0,IMPRIMIR!A25)","v":0},{"$f":"IF(E26=0,0,IMPRIMIR!$D$3)","v":0},0,{"$f":"IMPRIMIR!B25","v":0},{"$f":"IMPRIMIR!C25","v":0},{"$f":"IF(E26=0,0,IMPRIMIR!D25)","v":0},{"$f":"IF(E26=0,0,IMPRIMIR!E25)","v":0},0,0,0]
[null,{"$f":"IF(E27=0,0,IMPRIMIR!A26)","v":0},{"$f":"IF(E27=0,0,IMPRIMIR!$D$3)","v":0},0,{"$f":"IMPRIMIR!B26","v":0},{"$f":"IMPRIMIR!C26","v":0},{"$f":"IF(E27=0,0,IMPRIMIR!D26)","v":0},{"$f":"IF(E27=0,0,IMPRIMIR!E26)","v":0},0,0,0]
[null,{"$f":"IF(E28=0,0,IMPRIMIR!A27)","v":0},{"$f":"IF(E28=0,0,IMPRIMIR!$D$3)","v":0},0,{"$f":"IMPRIMIR!B27","v":0},{"$f":"IMPRIMIR!C27","v":0},{"$f":"IF(E28=0,0,IMPRIMIR!D27)","v":0},{"$f":"IF(E28=0,0,IMPRIMIR!E27)","v":0},0,0,0]
[null,{"$f":"IF(E29=0,0,IMPRIMIR!A28)","v":0},{"$f":"IF(E29=0,0,IMPRIMIR!$D$3)","v":0},0,{"$f":"IMPRIMIR!B28","v":0},{"$f":"IMPRIMIR!C28","v":0},{"$f":"IF(E29=0,0,IMPRIMIR!D28)","v":0},{"$f":"IF(E29=0,0,IMPRIMIR!E28)","v":0},0,0,0]
[null,{"$f":"IF(E30=0,0,IMPRIMIR!A29)","v":0},{"$f":"IF(E30=0,0,IMPRIMIR!$D$3)","v":0},0,{"$f":"IMPRIMIR!B29","v":0},{"$f":"IMPRIMIR!C29","v":0},{"$f":"IF(E30=0,0,IMPRIMIR!D29)","v":0},{"$f":"IF(E30=0,0,IMPRIMIR!E29)","v":0},0,0,0]
[null,{"$f":"IF(E31=0,0,IMPRIMIR!A30)","v":0},{"$f":"IF(E31=0,0,IMPRIMIR!$D$3)","v":0},0,{"$f":"IMPRIMIR!B30","v":0},{"$f":"IMPRIMIR!C30","v":0},{"$f":"IF(E31=0,0,IMPRIMIR!D30)","v":0},{"$f":"IF(E31=0,0,IMPRIMIR!E30)","v":0},0,0,0]
[null,{"$f":"IF(E32=0,0,IMPRIMIR!A31)","v":0},{"$f":"IF(E32=0,0,IMPRIMIR!$D$3)","v":0},0,{"$f":"IMPRIMIR!B31","v":0},{"$f":"IMPRIMIR!C31","v":0},{"$f":"IF(E32=0,0,IMPRIMIR!D31)","v":0},{"$f":"IF(E32=0,0,IMPRIMIR!E31)","v":0},0,0,0]
[null,{"$f":"IF(E33=0,0,IMPRIMIR!A32)","v":0},{"$f":"IF(E33=0,0,IMPRIMIR!$D$3)","v":0},0,{"$f":"IMPRIMIR!B32","v":0},{"$f":"IMPRIMIR!C32","v":0},{"$f":"IF(E33=0,0,IMPRIMIR!D32)","v":0},{"$f":"IF(E33=0,0,IMPRIMIR!E32)","v":0},0,0,0]
[null,{"$f":"IF(E34=0,0,IMPRIMIR!A33)","v":0},{"$f":"IF(E34=0,0,IMPRIMIR!$D$3)","v":0},0,{"$f":"IMPRIMIR!B33","v":0},{"$f":"IMPRIMIR!C33","v":0},{"$f":"IF(E34=0,0,IMPRIMIR!D33)","v":0},{"$f":"IF(E34=0,0,IMPRIMIR!E33)","v":0},0,0,0]
[null,{"$f":"IF(E35=0,0,IMPRIMIR!A34)","v":0},{"$f":"IF(E35=0,0,IMPRIMIR!$D$3)","v":0},0,{"$f":"IMPRIMIR!B34","v":0},{"$f":"IMPRIMIR!C34","v":0},{"$f":"IF(E35=0,0,IMPRIMIR!D34)","v":0},{"$f":"IF(E35=0,0,IMPRIMIR!E34)","v":0},0,0,0]
[null,{"$f":"IF(E36=0,0,IMPRIMIR!A35)","v":0},{"$f":"IF(E36=0,0,IMPRIMIR!$D$3)","v":0},0,{"$f":"IMPRIMIR!B35","v":0},{"$f":"IMPRIMIR!C35","v":0},{"$f":"IF(E36=0,0,IMPRIMIR!D35)","v":0},{"$f":"IF(E36=0,0,IMPRIMIR!E35)","v":0},0,0,0]
[null,{"$f":"IF(E37=0,0,IMPRIMIR!A36)","v":0},{"$f":"IF(E37=0,0,IMPRIMIR!$D$3)","v":0},0,{"$f":"IMPRIMIR!B36","v":0},{"$f":"IMPRIMIR!C36","v":0},{"$f":"IF(E37=0,0,IMPRIMIR!D36)","v":0},{"$f":"IF(E37=0,0,IMPRIMIR!E36)","v":0},0,0,0]
[null,{"$f":"IF(E38=0,0,IMPRIMIR!A37)","v":0},{"$f":"IF(E38=0,0,IMPRIMIR!$D$3)","v":0},0,{"$f":"IMPRIMIR!B37","v":0},{"$f":"IMPRIMIR!C37","v":0},{"$f":"IF(E38=0,0,IMPRIMIR!D37)","v":0},{"$f":"IF(E38=0,0,IMPRIMIR!E37)","v":0},0,0,0]
[null,{"$f":"IF(E39=0,0,IMPRIMIR!A38)","v":0},{"$f":"IF(E39=0,0,IMPRIMIR!$D$3)","v":0},0,{"$f":"IMPRIMIR!B38","v":0},{"$f":"IMPRIMIR!C38","v":0},{"$f":"IF(E39=0,0,IMPRIMIR!D38)","v":0},{"$f":"IF(E39=0,0,IMPRIMIR!E38)","v":0},0,0,0]
[null,{"$f":"IF(E40=0,0,IMPRIMIR!A39)","v":0},{"$f":"IF(E40=0,0,IMPRIMIR!$D$3)","v":0},0,{"$f":"IMPRIMIR!B39","v":0},{"$f":"IMPRIMIR!C39","v":0},{"$f":"IF(E40=0,0,IMPRIMIR!D39)","v":0},{"$f":"IF(E40=0,0,IMPRIMIR!E39)","v":0},0,0,0]
[null,{"$f":"IF(E41=0,0,IMPRIMIR!A40)","v":0},{"$f":"IF(E41=0,0,IMPRIMIR!$D$3)","v":0},0,{"$f":"IMPRIMIR!B40","v":0},{"$f":"IMPRIMIR!C40","v":0},{"$f":"IF(E41=0,0,IMPRIMIR!D40)","v":0},{"$f":"IF(E41=0,0,IMPRIMIR!E40)","v":0},0,0,0]
[null,{"$f":"IF(E42=0,0,IMPRIMIR!A41)","v":0},{"$f":"IF(E42=0,0,IMPRIMIR!$D$3)","v":0},0,{"$f":"IMPRIMIR!B41","v":0},{"$f":"IMPRIMIR!C41","v":0},{"$f":"IF(E42=0,0,IMPRIMIR!D41)","v":0},{"$f":"IF(E42=0,0,IMPRIMIR!E41)","v":0},0,0,0]
[null,{"$f":"IF(E43=0,0,IMPRIMIR!A42)","v":0},{"$f":"IF(E43=0,0,IMPRIMIR!$D$3)","v":0},0,{"$f":"IMPRIMIR!B42","v":0},{"$f":"IMPRIMIR!C42","v":0},{"$f":"IF(E43=0,0,IMPRIMIR!D42)","v":0},{"$f":"IF(E43=0,0,IMPRIMIR!E42)","v":0},0,0,0]
[null,{"$f":"IF(E44=0,0,IMPRIMIR!A43)","v":0},{"$f":"IF(E44=0,0,IMPRIMIR!$D$3)","v":0},0,{"$f":"IMPRIMIR!B43","v":0},{"$f":"IMPRIMIR!C43","v":0},{"$f":"IF(E44=0,0,IMPRIMIR!D43)","v":0},{"$f":"IF(E44=0,0,IMPRIMIR!E43)","v":0},0,0,0]
[null,{"$f":"IF(E45=0,0,IMPRIMIR!A44)","v":0},{"$f":"IF(E45=0,0,IMPRIMIR!$D$3)","v":0},0,{"$f":"IMPRIMIR!B44","v":0},{"$f":"IMPRIMIR!C44","v":0},{"$f":"IF(E45=0,0,IMPRIMIR!D44)","v":0},{"$f":"IF(E45=0,0,IMPRIMIR!E44)","v":0},0,0,0]
[null,{"$f":"IF(E46=0,0,IMPRIMIR!A45)","v":0},{"$f":"IF(E46=0,0,IMPRIMIR!$D$3)","v":0},0,{"$f":"IMPRIMIR!B45","v":0},{"$f":"IMPRIMIR!C45","v":0},{"$f":"IF(E46=0,0,IMPRIMIR!D45)","v":0},{"$f":"IF(E46=0,0,IMPRIMIR!E45)","v":0},0,0,0]
[null,{"$f":"IF(E47=0,0,IMPRIMIR!A46)","v":0},{"$f":"IF(E47=0,0,IMPRIMIR!$D$3)","v":0},0,{"$f":"IMPRIMIR!B46","v":0},{"$f":"IMPRIMIR!C46","v":0},{"$f":"IF(E47=0,0,IMPRIMIR!D46)","v":0},{"$f":"IF(E47=0,0,IMPRIMIR!E46)","v":0},0,0,0]
[null,{"$f":"IF(E48=0,0,IMPRIMIR!A47)","v":0},{"$f":"IF(E48=0,0,IMPRIMIR!$D$3)","v":0},0,{"$f":"IMPRIMIR!B47","v":0},{"$f":"IMPRIMIR!C47","v":0},{"$f":"IF(E48=0,0,IMPRIMIR!D47)","v":0},{"$f":"IF(E48=0,0,IMPRIMIR!E47)","v":0},0,0,0]
[null,{"$f":"IF(E49=0,0,IMPRIMIR!A48)","v":0},{"$f":"IF(E49=0,0,IMPRIMIR!$D$3)","v":0},0,{"$f":"IMPRIMIR!B48","v":0},{"$f":"IMPRIMIR!C48","v":0},{"$f":"IF(E49=0,0,IMPRIMIR!D48)","v":0},{"$f":"IF(E49=0,0,IMPRIMIR!E48)","v":0},0,0,0]
[null,{"$f":"IF(E50=0,0,IMPRIMIR!A49)","v":0},{"$f":"IF(E50=0,0,IMPRIMIR!$D$3)","v":0},0,{"$f":"IMPRIMIR!B49","v":0},{"$f":"IMPRIMIR!C49","v":0},{"$f":"IF(E50=0,0,IMPRIMIR!D49)","v":0},{"$f":"IF(E50=0,0,IMPRIMIR!E49)","v":0},0,0,0]
[null,{"$f":"IF(E51=0,0,IMPRIMIR!A50)","v":0},{"$f":"IF(E51=0,0,IMPRIMIR!$D$3)","v":0},0,{"$f":"IMPRIMIR!B50","v":0},{"$f":"IMPRIMIR!C50","v":0},{"$f":"IF(E51=0,0,IMPRIMIR!D50)","v":0},{"$f":"IF(E51=0,0,IMPRIMIR!E50)","v":0},0,0,0]
[null,{"$f":"IF(E52=0,0,IMPRIMIR!A51)","v":0},{"$f":"IF(E52=0,0,IMPRIMIR!$D$3)","v":0},0,{"$f":"IMPRIMIR!B51","v":0},{"$f":"IMPRIMIR!C51","v":0},{"$f":"IF(E52=0,0,IMPRIMIR!D51)","v":0},{"$f":"IF(E52=0,0,IMPRIMIR!E51)","v":0},0,0,0]
[null,{"$f":"IF(E53=0,0,IMPRIMIR!A52)","v":0},{"$f":"IF(E53=0,0,IMPRIMIR!$D$3)","v":0},0,{"$f":"IMPRIMIR!B52","v":0},{"$f":"IMPRIMIR!C52","v":0},{"$f":"IF(E53=0,0,IMPRIMIR!D52)","v":0},{"$f":"IF(E53=0,0,IMPRIMIR!E52)","v":0},0,0,0]
[null,{"$f":"IF(E54=0,0,IMPRIMIR!A53)","v":0},{"$f":"IF(E54=0,0,IMPRIMIR!$D$3)","v":0},0,{"$f":"IMPRIMIR!B53","v":0},{"$f":"IMPRIMIR!C53","v":0},{"$f":"IF(E54=0,0,IMPRIMIR!D53)","v":0},{"$f":"IF(E54=0,0,IMPRIMIR!E53)","v":0},0,0,0]
[null,{"$f":"IF(E55=0,0,IMPRIMIR!A54)","v":0},{"$f":"IF(E55=0,0,IMPRIMIR!$D$3)","v":0},0,{"$f":"IMPRIMIR!B54","v":0},{"$f":"IMPRIMIR!C54","v":0},{"$f":"IF(E55=0,0,IMPRIMIR!D54)","v":0},{"$f":"IF(E55=0,0,IMPRIMIR!E54)","v":0},0,0,0]
[null,{"$f":"IF(E56=0,0,IMPRIMIR!A55)","v":0},{"$f":"IF(E56=0,0,IMPRIMIR!$D$3)","v":0},0,{"$f":"IMPRIMIR!B55","v":0},{"$f":"IMPRIMIR!C55","v":0},{"$f":"IF(E56=0,0,IMPRIMIR!D55)","v":0},{"$f":"IF(E56=0,0,IMPRIMIR!E55)","v":0},0,0,0]
[null,{"$f":"IF(E57=0,0,IMPRIMIR!A56)","v":0},{"$f":"IF(E57=0,0,IMPRIMIR!$D$3)","v":0},0,{"$f":"IMPRIMIR!B56","v":0},{"$f":"IMPRIMIR!C56","v":0},{"$f":"IF(E57=0,0,IMPRIMIR!D56)","v":0},{"$f":"IF(E57=0,0,IMPRIMIR!E56)","v":0},0,0,0]
[null,{"$f":"IF(E58=0,0,IMPRIMIR!A57)","v":0},{"$f":"IF(E58=0,0,IMPRIMIR!$D$3)","v":0},0,{"$f":"IMPRIMIR!B57","v":0},{"$f":"IMPRIMIR!C57","v":0},{"$f":"IF(E58=0,0,IMPRIMIR!D57)","v":0},{"$f":"IF(E58=0,0,IMPRIMIR!E57)","v":0},0,0,0]
[null,{"$f":"IF(E59=0,0,IMPRIMIR!A58)","v":0},{"$f":"IF(E59=0,0,IMPRIMIR!$D$3)","v":0},0,{"$f":"IMPRIMIR!B58","v":0},{"$f":"IMPRIMIR!C58","v":0},{"$f":"IF(E59=0,0,IMPRIMIR!D58)","v":0},{"$f":"IF(E59=0,0,IMPRIMIR!E58)","v":0},0,0,0]
[null,{"$f":"IF(E60=0,0,IMPRIMIR!A59)","v":0},{"$f":"IF(E60=0,0,IMPRIMIR!$D$3)","v":0},0,{"$f":"IMPRIMIR!B59","v":0},{"$f":"IMPRIMIR!C59","v":0},{"$f":"IF(E60=0,0,IMPRIMIR!D59)","v":0},{"$f":"IF(E60=0,0,IMPRIMIR!E59)","v":0},0,0,0]
[null,{"$f":"IF(E61=0,0,IMPRIMIR!A60)","v":0},{"$f":"IF(E61=0,0,IMPRIMIR!$D$3)","v":0},0,{"$f":"IMPRIMIR!B60","v":0},{"$f":"IMPRIMIR!C60","v":0},{"$f":"IF(E61=0,0,IMPRIMIR!D60)","v":0},{"$f":"IF(E61=0,0,IMPRIMIR!E60)","v":0},0,0,0]
[null,{"$f":"IF(E62=0,0,IMPRIMIR!A61)","v":0},{"$f":"IF(E62=0,0,IMPRIMIR!$D$3)","v":0},0,{"$f":"IMPRIMIR!B61","v":0},{"$f":"IMPRIMIR!C61","v":0},{"$f":"IF(E62=0,0,IMPRIMIR!D61)","v":0},{"$f":"IF(E62=0,0,IMPRIMIR!E61)","v":0},0,0,0]
[null,{"$f":"IF(E63=0,0,IMPRIMIR!A62)","v":0},{"$f":"IF(E63=0,0,IMPRIMIR!$D$3)","v":0},0,{"$f":"IMPRIMIR!B62","v":0},{"$f":"IMPRIMIR!C62","v":0},{"$f":"IF(E63=0,0,IMPRIMIR!D62)","v":0},{"$f":"IF(E63=0,0,IMPRIMIR!E62)","v":0},0,0,0]
[null,{"$f":"IF(E64=0,0,IMPRIMIR!A63)","v":0},{"$f":"IF(E64=0,0,IMPRIMIR!$D$3)","v":0},0,{"$f":"IMPRIMIR!B63","v":0},{"$f":"IMPRIMIR!C63","v":0},{"$f":"IF(E64=0,0,IMPRIMIR!D63)","v":0},{"$f":"IF(E64=0,0,IMPRIMIR!E63)","v":0},0,0,0]
[null,{"$f":"IF(E65=0,0,IMPRIMIR!A64)","v":0},{"$f":"IF(E65=0,0,IMPRIMIR!$D$3)","v":0},0,{"$f":"IMPRIMIR!B64","v":0},{"$f":"IMPRIMIR!C64","v":0},{"$f":"IF(E65=0,0,IMPRIMIR!D64)","v":0},{"$f":"IF(E65=0,0,IMPRIMIR!E64)","v":0},0,0,0]
[null,{"$f":"IF(E66=0,0,IMPRIMIR!A65)","v":0},{"$f":"IF(E66=0,0,IMPRIMIR!$D$3)","v":0},0,{"$f":"IMPRIMIR!B65","v":0},{"$f":"IMPRIMIR!C65","v":0},{"$f":"IF(E66=0,0,IMPRIMIR!D65)","v":0},{"$f":"IF(E66=0,0,IMPRIMIR!E65)","v":0},0,0,0]
[null,{"$f":"IF(E67=0,0,IMPRIMIR!A66)","v":0},{"$f":"IF(E67=0,0,IMPRIMIR!$D$3)","v":0},0,{"$f":"IMPRIMIR!B66","v":0},{"$f":"IMPRIMIR!C66","v":0},{"$f":"IF(E67=0,0,IMPRIMIR!D66)","v":0},{"$f":"IF(E67=0,0,IMPRIMIR!E66)","v":0},0,0,0]
[null,{"$f":"IF(E68=0,0,IMPRIMIR!A67)","v":0},{"$f":"IF(E68=0,0,IMPRIMIR!$D$3)","v":0},0,{"$f":"IMPRIMIR!B67","v":0},{"$f":"IMPRIMIR!C67","v":0},{"$f":"IF(E68=0,0,IMPRIMIR!D67)","v":0},{"$f":"IF(E68=0,0,IMPRIMIR!E67)","v":0},0,0,0]
[null,{"$f":"IF(E69=0,0,IMPRIMIR!A68)","v":0},{"$f":"IF(E69=0,0,IMPRIMIR!$D$3)","v":0},0,{"$f":"IMPRIMIR!B68","v":0},{"$f":"IMPRIMIR!C68","v":0},{"$f":"IF(E69=0,0,IMPRIMIR!D68)","v":0},{"$f":"IF(E69=0,0,IMPRIMIR!E68)","v":0},0,0,0]
[null,{"$f":"IF(E70=0,0,IMPRIMIR!A69)","v":0},{"$f":"IF(E70=0,0,IMPRIMIR!$D$3)","v":0},0,{"$f":"IMPRIMIR!B69","v":0},{"$f":"IMPRIMIR!C69","v":0},{"$f":"IF(E70=0,0,IMPRIMIR!D69)","v":0},{"$f":"IF(E70=0,0,IMPRIMIR!E69)","v":0},0,0,0]
[null,{"$f":"IF(E71=0,0,IMPRIMIR!A70)","v":0},{"$f":"IF(E71=0,0,IMPRIMIR!$D$3)","v":0},0,{"$f":"IMPRIMIR!B70","v":0},{"$f":"IMPRIMIR!C70","v":0},{"$f":"IF(E71=0,0,IMPRIMIR!D70)","v":0},{"$f":"IF(E71=0,0,IMPRIMIR!E70)","v":0},0,0,0]
[null,{"$f":"IF(E72=0,0,IMPRIMIR!A71)","v":0},{"$f":"IF(E72=0,0,IMPRIMIR!$D$3)","v":0},0,{"$f":"IMPRIMIR!B71","v":0},{"$f":"IMPRIMIR!C71","v":0},{"$f":"IF(E72=0,0,IMPRIMIR!D71)","v":0},{"$f":"IF(E72=0,0,IMPRIMIR!E71)","v":0},0,0,0]
[null,{"$f":"IF(E73=0,0,IMPRIMIR!A72)","v":0},{"$f":"IF(E73=0,0,IMPRIMIR!$D$3)","v":0},{"$f":"IF(E73=\"0\",0,$G$2)","v":0},{"$f":"IMPRIMIR!B72","v":0},{"$f":"IMPRIMIR!C72","v":0},{"$f":"IF(E73=0,0,IMPRIMIR!D72)","v":0},{"$f":"IF(E73=0,0,IMPRIMIR!E72)","v":0},{"$f":"IF(E73=0,0,$G$2)","v":0},{"$f":"IF(E73=0,0,$G$4)","v":0},{"$f":"IF(E73=0,0,$G$3)","v":0}]
[null,{"$f":"IF(E74=0,0,IMPRIMIR!A73)","v":0},{"$f":"IF(E74=0,0,IMPRIMIR!$D$3)","v":0},0,{"$f":"IMPRIMIR!B73","v":0},{"$f":"IMPRIMIR!C73","v":0},{"$f":"IF(E74=0,0,IMPRIMIR!D73)","v":0},{"$f":"IF(E74=0,0,IMPRIMIR!E73)","v":0},0,0,0]
[null,{"$f":"IF(E75=0,0,IMPRIMIR!A74)","v":0},{"$f":"IF(E75=0,0,IMPRIMIR!$D$3)","v":0},0,{"$f":"IMPRIMIR!B74","v":0},{"$f":"IMPRIMIR!C74","v":0},{"$f":"IF(E75=0,0,IMPRIMIR!D74)","v":0},{"$f":"IF(E75=0,0,IMPRIMIR!E74)","v":0},0,0,0]
[null,{"$f":"IF(E76=0,0,IMPRIMIR!A75)","v":0},{"$f":"IF(E76=0,0,IMPRIMIR!$D$3)","v":0},0,{"$f":"IMPRIMIR!B75","v":0},{"$f":"IMPRIMIR!C75","v":0},{"$f":"IF(E76=0,0,IMPRIMIR!D75)","v":0},{"$f":"IF(E76=0,0,IMPRIMIR!E75)","v":0},0,0,0]
[null,{"$f":"IF(E77=0,0,IMPRIMIR!A76)","v":0},{"$f":"IF(E77=0,0,IMPRIMIR!$D$3)","v":0},0,{"$f":"IMPRIMIR!B76","v":0},{"$f":"IMPRIMIR!C76","v":0},{"$f":"IF(E77=0,0,IMPRIMIR!D76)","v":0},{"$f":"IF(E77=0,0,IMPRIMIR!E76)","v":0},0,0,0]
[null,{"$f":"IF(E78=0,0,IMPRIMIR!A77)","v":0},{"$f":"IF(E78=0,0,IMPRIMIR!$D$3)","v":0},0,{"$f":"IMPRIMIR!B77","v":0},{"$f":"IMPRIMIR!C77","v":0},{"$f":"IF(E78=0,0,IMPRIMIR!D77)","v":0},{"$f":"IF(E78=0,0,IMPRIMIR!E77)","v":0},0,0,0]
[null,{"$f":"IF(E79=0,0,IMPRIMIR!A78)","v":0},{"$f":"IF(E79=0,0,IMPRIMIR!$D$3)","v":0},0,{"$f":"IMPRIMIR!B78","v":0},{"$f":"IMPRIMIR!C78","v":0},{"$f":"IF(E79=0,0,IMPRIMIR!D78)","v":0},{"$f":"IF(E79=0,0,IMPRIMIR!E78)","v":0},0,0,0]
[null,{"$f":"IF(E80=0,0,IMPRIMIR!A79)","v":0},{"$f":"IF(E80=0,0,IMPRIMIR!$D$3)","v":0},0,{"$f":"IMPRIMIR!B79","v":0},{"$f":"IMPRIMIR!C79","v":0},{"$f":"IF(E80=0,0,IMPRIMIR!D79)","v":0},{"$f":"IF(E80=0,0,IMPRIMIR!E79)","v":0},0,0,0]
[null,{"$f":"IF(E81=0,0,IMPRIMIR!A80)","v":0},{"$f":"IF(E81=0,0,IMPRIMIR!$D$3)","v":0},0,{"$f":"IMPRIMIR!B80","v":0},{"$f":"IMPRIMIR!C80","v":0},{"$f":"IF(E81=0,0,IMPRIMIR!D80)","v":0},{"$f":"IF(E81=0,0,IMPRIMIR!E80)","v":0},0,0,0]
[null,{"$f":"IF(E82=0,0,IMPRIMIR!A81)","v":0},{"$f":"IF(E82=0,0,IMPRIMIR!$D$3)","v":0},0,{"$f":"IMPRIMIR!B81","v":0},{"$f":"IMPRIMIR!C81","v":0},{"$f":"IF(E82=0,0,IMPRIMIR!D81)","v":0},{"$f":"IF(E82=0,0,IMPRIMIR!E81)","v":0},0,0,0]
[null,{"$f":"IF(E83=0,0,IMPRIMIR!A82)","v":0},{"$f":"IF(E83=0,0,IMPRIMIR!$D$3)","v":0},0,{"$f":"IMPRIMIR!B82","v":0},{"$f":"IMPRIMIR!C82","v":0},{"$f":"IF(E83=0,0,IMPRIMIR!D82)","v":0},{"$f":"IF(E83=0,0,IMPRIMIR!E82)","v":0},0,0,0]
[null,{"$f":"IF(E84=0,0,IMPRIMIR!A83)","v":0},{"$f":"IF(E84=0,0,IMPRIMIR!$D$3)","v":0},0,{"$f":"IMPRIMIR!B83","v":0},{"$f":"IMPRIMIR!C83","v":0},{"$f":"IF(E84=0,0,IMPRIMIR!D83)","v":0},{"$f":"IF(E84=0,0,IMPRIMIR!E83)","v":0},0,0,0]
[null,{"$f":"IF(E85=0,0,IMPRIMIR!A84)","v":0},{"$f":"IF(E85=0,0,IMPRIMIR!$D$3)","v":0},0,{"$f":"IMPRIMIR!B84","v":0},{"$f":"IMPRIMIR!C84","v":0},{"$f":"IF(E85=0,0,IMPRIMIR!D84)","v":0},{"$f":"IF(E85=0,0,IMPRIMIR!E84)","v":0},0,0,0]
[null,{"$f":"IF(E86=0,0,IMPRIMIR!A85)","v":0},{"$f":"IF(E86=0,0,IMPRIMIR!$D$3)","v":0},0,{"$f":"IMPRIMIR!B85","v":0},{"$f":"IMPRIMIR!C85","v":0},{"$f":"IF(E86=0,0,IMPRIMIR!D85)","v":0},{"$f":"IF(E86=0,0,IMPRIMIR!E85)","v":0},0,0,0]
[null,{"$f":"IF(E87=0,0,IMPRIMIR!A86)","v":0},{"$f":"IF(E87=0,0,IMPRIMIR!$D$3)","v":0},0,{"$f":"IMPRIMIR!B86","v":0},{"$f":"IMPRIMIR!C86","v":0},{"$f":"IF(E87=0,0,IMPRIMIR!D86)","v":0},{"$f":"IF(E87=0,0,IMPRIMIR!E86)","v":0},0,0,0]
[null,{"$f":"IF(E88=0,0,IMPRIMIR!A87)","v":0},{"$f":"IF(E88=0,0,IMPRIMIR!$D$3)","v":0},0,{"$f":"IMPRIMIR!B87","v":0},{"$f":"IMPRIMIR!C87","v":0},{"$f":"IF(E88=0,0,IMPRIMIR!D87)","v":0},{"$f":"IF(E88=0,0,IMPRIMIR!E87)","v":0},0,0,0]
[null,{"$f":"IF(E89=0,0,IMPRIMIR!A88)","v":0},{"$f":"IF(E89=0,0,IMPRIMIR!$D$3)","v":0},0,{"$f":"IMPRIMIR!B88","v":0},{"$f":"IMPRIMIR!C88","v":0},{"$f":"IF(E89=0,0,IMPRIMIR!D88)","v":0},{"$f":"IF(E89=0,0,IMPRIMIR!E88)","v":0},0,0,0]
[null,{"$f":"IF(E90=0,0,IMPRIMIR!A89)","v":0},{"$f":"IF(E90=0,0,IMPRIMIR!$D$3)","v":0},0,{"$f":"IMPRIMIR!B89","v":0},{"$f":"IMPRIMIR!C89","v":0},{"$f":"IF(E90=0,0,IMPRIMIR!D89)","v":0},{"$f":"IF(E90=0,0,IMPRIMIR!E89)","v":0},0,0,0]
[null,{"$f":"IF(E91=0,0,IMPRIMIR!A90)","v":0},{"$f":"IF(E91=0,0,IMPRIMIR!$D$3)","v":0},0,{"$f":"IMPRIMIR!B90","v":0},{"$f":"IMPRIMIR!C90","v":0},{"$f":"IF(E91=0,0,IMPRIMIR!D90)","v":0},{"$f":"IF(E91=0,0,IMPRIMIR!E90)","v":0},0,0,0]
[null,{"$f":"IF(E92=0,0,IMPRIMIR!A91)","v":0},{"$f":"IF(E92=0,0,IMPRIMIR!$D$3)","v":0},0,{"$f":"IMPRIMIR!B91","v":0},{"$f":"IMPRIMIR!C91","v":0},{"$f":"IF(E92=0,0,IMPRIMIR!D91)","v":0},{"$f":"IF(E92=0,0,IMPRIMIR!E91)","v":0},0,0,0]
[null,{"$f":"IF(E93=0,0,IMPRIMIR!A92)","v":0},{"$f":"IF(E93=0,0,IMPRIMIR!$D$3)","v":0},0,{"$f":"IMPRIMIR!B92","v":0},{"$f":"IMPRIMIR!C92","v":0},{"$f":"IF(E93=0,0,IMPRIMIR!D92)","v":0},{"$f":"IF(E93=0,0,IMPRIMIR!E92)","v":0},0,0,0]
[null,{"$f":"IF(E94=0,0,IMPRIMIR!A93)","v":0},{"$f":"IF(E94=0,0,IMPRIMIR!$D$3)","v":0},0,{"$f":"IMPRIMIR!B93","v":0},{"$f":"IMPRIMIR!C93","v":0},{"$f":"IF(E94=0,0,IMPRIMIR!D93)","v":0},{"$f":"IF(E94=0,0,IMPRIMIR!E93)","v":0},0,0,0]
[null,{"$f":"IF(E95=0,0,IMPRIMIR!A94)","v":0},{"$f":"IF(E95=0,0,IMPRIMIR!$D$3)","v":0},0,{"$f":"IMPRIMIR!B94","v":0},{"$f":"IMPRIMIR!C94","v":0},{"$f":"IF(E95=0,0,IMPRIMIR!D94)","v":0},{"$f":"IF(E95=0,0,IMPRIMIR!E94)","v":0},0,0,0]
[null,{"$f":"IF(E96=0,0,IMPRIMIR!A95)","v":0},{"$f":"IF(E96=0,0,IMPRIMIR!$D$3)","v":0},0,{"$f":"IMPRIMIR!B95","v":0},{"$f":"IMPRIMIR!C95","v":0},{"$f":"IF(E96=0,0,IMPRIMIR!D95)","v":0},{"$f":"IF(E96=0,0,IMPRIMIR!E95)","v":0},0,0,0]
[null,{"$f":"IF(E97=0,0,IMPRIMIR!A96)","v":0},{"$f":"IF(E97=0,0,IMPRIMIR!$D$3)","v":0},0,{"$f":"IMPRIMIR!B96","v":0},{"$f":"IMPRIMIR!C96","v":0},{"$f":"IF(E97=0,0,IMPRIMIR!D96)","v":0},{"$f":"IF(E97=0,0,IMPRIMIR!E96)","v":0},0,0,0]
[null,{"$f":"IF(E98=0,0,IMPRIMIR!A97)","v":0},{"$f":"IF(E98=0,0,IMPRIMIR!$D$3)","v":0},0,{"$f":"IMPRIMIR!B97","v":0},{"$f":"IMPRIMIR!C97","v":0},{"$f":"IF(E98=0,0,IMPRIMIR!D97)","v":0},{"$f":"IF(E98=0,0,IMPRIMIR!E97)","v":0},0,0,0]
[null,{"$f":"IF(E99=0,0,IMPRIMIR!A98)","v":0},{"$f":"IF(E99=0,0,IMPRIMIR!$D$3)","v":0},0,{"$f":"IMPRIMIR!B98","v":0},{"$f":"IMPRIMIR!C98","v":0},{"$f":"IF(E99=0,0,IMPRIMIR!D98)","v":0},{"$f":"IF(E99=0,0,IMPRIMIR!E98)","v":0},0,0,0]
[null,{"$f":"IF(E100=0,0,IMPRIMIR!A99)","v":0},{"$f":"IF(E100=0,0,IMPRIMIR!$D$3)","v":0},0,{"$f":"IMPRIMIR!B99","v":0},{"$f":"IMPRIMIR!C99","v":0},{"$f":"IF(E100=0,0,IMPRIMIR!D99)","v":0},{"$f":"IF(E100=0,0,IMPRIMIR!E99)","v":0},0,0,0]
[null,{"$f":"IF(E101=0,0,IMPRIMIR!A100)","v":0},{"$f":"IF(E101=0,0,IMPRIMIR!$D$3)","v":0},0,{"$f":"IMPRIMIR!B100","v":0},{"$f":"IMPRIMIR!C100","v":0},{"$f":"IF(E101=0,0,IMPRIMIR!D100)","v":0},{"$f":"IF(E101=0,0,IMPRIMIR!E100)","v":0},0,0,0]
[null,{"$f":"IF(E102=0,0,IMPRIMIR!A101)","v":0},{"$f":"IF(E102=0,0,IMPRIMIR!$D$3)","v":0},0,{"$f":"IMPRIMIR!B101","v":0},{"$f":"IMPRIMIR!C101","v":0},{"$f":"IF(E102=0,0,IMPRIMIR!D101)","v":0},{"$f":"IF(E102=0,0,IMPRIMIR!E101)","v":0},0,0,0]
[null,{"$f":"IF(E103=0,0,IMPRIMIR!A102)","v":0},{"$f":"IF(E103=0,0,IMPRIMIR!$D$3)","v":0},0,{"$f":"IMPRIMIR!B102","v":0},{"$f":"IMPRIMIR!C102","v":0},{"$f":"IF(E103=0,0,IMPRIMIR!D102)","v":0},{"$f":"IF(E103=0,0,IMPRIMIR!E102)","v":0},0,0,0]
[null,{"$f":"IF(E104=0,0,IMPRIMIR!A103)","v":0},{"$f":"IF(E104=0,0,IMPRIMIR!$D$3)","v":0},0,{"$f":"IMPRIMIR!B103","v":0},{"$f":"IMPRIMIR!C103","v":0},{"$f":"IF(E104=0,0,IMPRIMIR!D103)","v":0},{"$f":"IF(E104=0,0,IMPRIMIR!E103)","v":0},0,0,0]
[null,{"$f":"IF(E105=0,0,IMPRIMIR!A104)","v":0},{"$f":"IF(E105=0,0,IMPRIMIR!$D$3)","v":0},0,{"$f":"IMPRIMIR!B104","v":0},{"$f":"IMPRIMIR!C104","v":0},{"$f":"IF(E105=0,0,IMPRIMIR!D104)","v":0},{"$f":"IF(E105=0,0,IMPRIMIR!E104)","v":0},0,0,0]
[null,{"$f":"IF(E106=0,0,IMPRIMIR!A105)","v":0},{"$f":"IF(E106=0,0,IMPRIMIR!$D$3)","v":0},0,{"$f":"IMPRIMIR!B105","v":0},{"$f":"IMPRIMIR!C105","v":0},{"$f":"IF(E106=0,0,IMPRIMIR!D105)","v":0},{"$f":"IF(E106=0,0,IMPRIMIR!E105)","v":0},0,0,0]
[null,{"$f":"IF(E107=0,0,IMPRIMIR!A106)","v":0},{"$f":"IF(E107=0,0,IMPRIMIR!$D$3)","v":0},0,{"$f":"IMPRIMIR!B106","v":0},{"$f":"IMPRIMIR!C106","v":0},{"$f":"IF(E107=0,0,IMPRIMIR!D106)","v":0},{"$f":"IF(E107=0,0,IMPRIMIR!E106)","v":0},0,0,0]
[null,{"$f":"IF(E108=0,0,IMPRIMIR!A107)","v":0},{"$f":"IF(E108=0,0,IMPRIMIR!$D$3)","v":0},0,{"$f":"IMPRIMIR!B107","v":0},{"$f":"IMPRIMIR!C107","v":0},{"$f":"IF(E108=0,0,IMPRIMIR!D107)","v":0},{"$f":"IF(E108=0,0,IMPRIMIR!E107)","v":0},0,0,0]
[null,{"$f":"IF(E109=0,0,IMPRIMIR!A108)","v":0},{"$f":"IF(E109=0,0,IMPRIMIR!$D$3)","v":0},0,{"$f":"IMPRIMIR!B108","v":0},{"$f":"IMPRIMIR!C108","v":0},{"$f":"IF(E109=0,0,IMPRIMIR!D108)","v":0},{"$f":"IF(E109=0,0,IMPRIMIR!E108)","v":0},0,0,0]
[null,{"$f":"IF(E110=0,0,IMPRIMIR!A109)","v":0},{"$f":"IF(E110=0,0,IMPRIMIR!$D$3)","v":0},0,{"$f":"IMPRIMIR!B109","v":0},{"$f":"IMPRIMIR!C109","v":0},{"$f":"IF(E110=0,0,IMPRIMIR!D109)","v":0},{"$f":"IF(E110=0,0,IMPRIMIR!E109)","v":0},0,0,0]
[null,{"$f":"IF(E111=0,0,IMPRIMIR!A110)","v":0},{"$f":"IF(E111=0,0,IMPRIMIR!$D$3)","v":0},0,{"$f":"IMPRIMIR!B110","v":0},{"$f":"IMPRIMIR!C110","v":0},{"$f":"IF(E111=0,0,IMPRIMIR!D110)","v":0},{"$f":"IF(E111=0,0,IMPRIMIR!E110)","v":0},0,0,0]
[null,{"$f":"IF(E112=0,0,IMPRIMIR!A111)","v":0},{"$f":"IF(E112=0,0,IMPRIMIR!$D$3)","v":0},0,{"$f":"IMPRIMIR!B111","v":0},{"$f":"IMPRIMIR!C111","v":0},{"$f":"IF(E112=0,0,IMPRIMIR!D111)","v":0},{"$f":"IF(E112=0,0,IMPRIMIR!E111)","v":0},0,0,0]
[null,{"$f":"IF(E113=0,0,IMPRIMIR!A112)","v":0},{"$f":"IF(E113=0,0,IMPRIMIR!$D$3)","v":0},0,{"$f":"IMPRIMIR!B112","v":0},{"$f":"IMPRIMIR!C112","v":0},{"$f":"IF(E113=0,0,IMPRIMIR!D112)","v":0},{"$f":"IF(E113=0,0,IMPRIMIR!E112)","v":0},0,0,0]
[null,{"$f":"IF(E114=0,0,IMPRIMIR!A113)","v":0},{"$f":"IF(E114=0,0,IMPRIMIR!$D$3)","v":0},0,{"$f":"IMPRIMIR!B113","v":0},{"$f":"IMPRIMIR!C113","v":0},{"$f":"IF(E114=0,0,IMPRIMIR!D113)","v":0},{"$f":"IF(E114=0,0,IMPRIMIR!E113)","v":0},0,0,0]
[null,{"$f":"IF(E115=0,0,IMPRIMIR!A114)","v":0},{"$f":"IF(E115=0,0,IMPRIMIR!$D$3)","v":0},0,{"$f":"IMPRIMIR!B114","v":0},{"$f":"IMPRIMIR!C114","v":0},{"$f":"IF(E115=0,0,IMPRIMIR!D114)","v":0},{"$f":"IF(E115=0,0,IMPRIMIR!E114)","v":0},0,0,0]
[null,{"$f":"IF(E116=0,0,IMPRIMIR!A115)","v":0},{"$f":"IF(E116=0,0,IMPRIMIR!$D$3)","v":0},0,{"$f":"IMPRIMIR!B115","v":0},{"$f":"IMPRIMIR!C115","v":0},{"$f":"IF(E116=0,0,IMPRIMIR!D115)","v":0},{"$f":"IF(E116=0,0,IMPRIMIR!E115)","v":0},0,0,0]
[null,{"$f":"IF(E117=0,0,IMPRIMIR!A116)","v":0},{"$f":"IF(E117=0,0,IMPRIMIR!$D$3)","v":0},0,{"$f":"IMPRIMIR!B116","v":0},{"$f":"IMPRIMIR!C116","v":0},{"$f":"IF(E117=0,0,IMPRIMIR!D116)","v":0},{"$f":"IF(E117=0,0,IMPRIMIR!E116)","v":0},0,0,0]
[null,{"$f":"IF(E118=0,0,IMPRIMIR!A117)","v":0},{"$f":"IF(E118=0,0,IMPRIMIR!$D$3)","v":0},0,{"$f":"IMPRIMIR!B117","v":0},{"$f":"IMPRIMIR!C117","v":0},{"$f":"IF(E118=0,0,IMPRIMIR!D117)","v":0},{"$f":"IF(E118=0,0,IMPRIMIR!E117)","v":0},0,0,0]
[null,{"$f":"IF(E119=0,0,IMPRIMIR!A118)","v":0},{"$f":"IF(E119=0,0,IMPRIMIR!$D$3)","v":0},0,{"$f":"IMPRIMIR!B118","v":0},{"$f":"IMPRIMIR!C118","v":0},{"$f":"IF(E119=0,0,IMPRIMIR!D118)","v":0},{"$f":"IF(E119=0,0,IMPRIMIR!E118)","v":0},0,0,0]
[null,{"$f":"IF(E120=0,0,IMPRIMIR!A119)","v":0},{"$f":"IF(E120=0,0,IMPRIMIR!$D$3)","v":0},0,{"$f":"IMPRIMIR!B119","v":0},{"$f":"IMPRIMIR!C119","v":0},{"$f":"IF(E120=0,0,IMPRIMIR!D119)","v":0},{"$f":"IF(E120=0,0,IMPRIMIR!E119)","v":0},0,0,0]
[null,{"$f":"IF(E121=0,0,IMPRIMIR!A120)","v":0},{"$f":"IF(E121=0,0,IMPRIMIR!$D$3)","v":0},0,{"$f":"IMPRIMIR!B120","v":0},{"$f":"IMPRIMIR!C120","v":0},{"$f":"IF(E121=0,0,IMPRIMIR!D120)","v":0},{"$f":"IF(E121=0,0,IMPRIMIR!E120)","v":0},0,0,0]
[null,{"$f":"IF(E122=0,0,IMPRIMIR!A121)","v":0},{"$f":"IF(E122=0,0,IMPRIMIR!$D$3)","v":0},0,{"$f":"IMPRIMIR!B121","v":0},{"$f":"IMPRIMIR!C121","v":0},{"$f":"IF(E122=0,0,IMPRIMIR!D121)","v":0},{"$f":"IF(E122=0,0,IMPRIMIR!E121)","v":0},0,0,0]
[null,{"$f":"IF(E123=0,0,IMPRIMIR!A122)","v":0},{"$f":"IF(E123=0,0,IMPRIMIR!$D$3)","v":0},0,{"$f":"IMPRIMIR!B122","v":0},{"$f":"IMPRIMIR!C122","v":0},{"$f":"IF(E123=0,0,IMPRIMIR!D122)","v":0},{"$f":"IF(E123=0,0,IMPRIMIR!E122)","v":0},0,0,0]
[null,{"$f":"IF(E124=0,0,IMPRIMIR!A123)","v":0},{"$f":"IF(E124=0,0,IMPRIMIR!$D$3)","v":0},0,{"$f":"IMPRIMIR!B123","v":0},{"$f":"IMPRIMIR!C123","v":0},{"$f":"IF(E124=0,0,IMPRIMIR!D123)","v":0},{"$f":"IF(E124=0,0,IMPRIMIR!E123)","v":0},0,0,0]
[null,{"$f":"IF(E125=0,0,IMPRIMIR!A124)","v":0},{"$f":"IF(E125=0,0,IMPRIMIR!$D$3)","v":0},0,{"$f":"IMPRIMIR!B124","v":0},{"$f":"IMPRIMIR!C124","v":0},{"$f":"IF(E125=0,0,IMPRIMIR!D124)","v":0},{"$f":"IF(E125=0,0,IMPRIMIR!E124)","v":0},0,0,0]
[null,{"$f":"IF(E126=0,0,IMPRIMIR!A125)","v":0},{"$f":"IF(E126=0,0,IMPRIMIR!$D$3)","v":0},0,{"$f":"IMPRIMIR!B125","v":0},{"$f":"IMPRIMIR!C125","v":0},{"$f":"IF(E126=0,0,IMPRIMIR!D125)","v":0},{"$f":"IF(E126=0,0,IMPRIMIR!E125)","v":0},0,0,0]
[null,{"$f":"IF(E127=0,0,IMPRIMIR!A126)","v":0},{"$f":"IF(E127=0,0,IMPRIMIR!$D$3)","v":0},0,{"$f":"IMPRIMIR!B126","v":0},{"$f":"IMPRIMIR!C126","v":0},{"$f":"IF(E127=0,0,IMPRIMIR!D126)","v":0},{"$f":"IF(E127=0,0,IMPRIMIR!E126)","v":0},0,0,0]
[null,{"$f":"IF(E128=0,0,IMPRIMIR!A127)","v":0},{"$f":"IF(E128=0,0,IMPRIMIR!$D$3)","v":0},0,{"$f":"IMPRIMIR!B127","v":0},{"$f":"IMPRIMIR!C127","v":0},{"$f":"IF(E128=0,0,IMPRIMIR!D127)","v":0},{"$f":"IF(E128=0,0,IMPRIMIR!E127)","v":0},0,0,0]
[null,{"$f":"IF(E129=0,0,IMPRIMIR!A128)","v":0},{"$f":"IF(E129=0,0,IMPRIMIR!$D$3)","v":0},0,{"$f":"IMPRIMIR!B128","v":0},{"$f":"IMPRIMIR!C128","v":0},{"$f":"IF(E129=0,0,IMPRIMIR!D128)","v":0},{"$f":"IF(E129=0,0,IMPRIMIR!E128)","v":0},0,0,0]
[null,{"$f":"IF(E130=0,0,IMPRIMIR!A129)","v":0},{"$f":"IF(E130=0,0,IMPRIMIR!$D$3)","v":0},0,{"$f":"IMPRIMIR!B129","v":0},{"$f":"IMPRIMIR!C129","v":0},{"$f":"IF(E130=0,0,IMPRIMIR!D129)","v":0},{"$f":"IF(E130=0,0,IMPRIMIR!E129)","v":0},0,0,0]
[null,{"$f":"IF(E131=0,0,IMPRIMIR!A130)","v":0},{"$f":"IF(E131=0,0,IMPRIMIR!$D$3)","v":0},0,{"$f":"IMPRIMIR!B130","v":0},{"$f":"IMPRIMIR!C130","v":0},{"$f":"IF(E131=0,0,IMPRIMIR!D130)","v":0},{"$f":"IF(E131=0,0,IMPRIMIR!E130)","v":0},0,0,0]
[null,{"$f":"IF(E132=0,0,IMPRIMIR!A131)","v":0},{"$f":"IF(E132=0,0,IMPRIMIR!$D$3)","v":0},0,{"$f":"IMPRIMIR!B131","v":0},{"$f":"IMPRIMIR!C131","v":0},{"$f":"IF(E132=0,0,IMPRIMIR!D131)","v":0},{"$f":"IF(E132=0,0,IMPRIMIR!E131)","v":0},0,0,0]
[null,{"$f":"IF(E133=0,0,IMPRIMIR!A132)","v":0},{"$f":"IF(E133=0,0,IMPRIMIR!$D$3)","v":0},0,{"$f":"IMPRIMIR!B132","v":0},{"$f":"IMPRIMIR!C132","v":0},{"$f":"IF(E133=0,0,IMPRIMIR!D132)","v":0},{"$f":"IF(E133=0,0,IMPRIMIR!E132)","v":0},0,0,0]
[null,{"$f":"IF(E134=0,0,IMPRIMIR!A133)","v":0},{"$f":"IF(E134=0,0,IMPRIMIR!$D$3)","v":0},0,{"$f":"IMPRIMIR!B133","v":0},{"$f":"IMPRIMIR!C133","v":0},{"$f":"IF(E134=0,0,IMPRIMIR!D133)","v":0},{"$f":"IF(E134=0,0,IMPRIMIR!E133)","v":0},0,0,0]
[null,{"$f":"IF(E135=0,0,IMPRIMIR!A134)","v":0},{"$f":"IF(E135=0,0,IMPRIMIR!$D$3)","v":0},0,{"$f":"IMPRIMIR!B134","v":0},{"$f":"IMPRIMIR!C134","v":0},{"$f":"IF(E135=0,0,IMPRIMIR!D134)","v":0},{"$f":"IF(E135=0,0,IMPRIMIR!E134)","v":0},0,0,0]
[null,{"$f":"IF(E136=0,0,IMPRIMIR!A135)","v":0},{"$f":"IF(E136=0,0,IMPRIMIR!$D$3)","v":0},0,{"$f":"IMPRIMIR!B135","v":0},{"$f":"IMPRIMIR!C135","v":0},{"$f":"IF(E136=0,0,IMPRIMIR!D135)","v":0},{"$f":"IF(E136=0,0,IMPRIMIR!E135)","v":0},0,0,0]
[null,{"$f":"IF(E137=0,0,IMPRIMIR!A136)","v":0},{"$f":"IF(E137=0,0,IMPRIMIR!$D$3)","v":0},{"$f":"IF(E137=\"0\",0,$G$2)","v":0},{"$f":"IMPRIMIR!B136","v":0},{"$f":"IMPRIMIR!C136","v":0},{"$f":"IF(E137=0,0,IMPRIMIR!D136)","v":0},{"$f":"IF(E137=0,0,IMPRIMIR!E136)","v":0},{"$f":"IF(E137=0,0,$G$2)","v":0},{"$f":"IF(E137=0,0,$G$4)","v":0},{"$f":"IF(E137=0,0,$G$3)","v":0}]
[null,{"$f":"IF(E138=0,0,IMPRIMIR!A137)","v":0},{"$f":"IF(E138=0,0,IMPRIMIR!$D$3)","v":0},0,{"$f":"IMPRIMIR!B137","v":0},{"$f":"IMPRIMIR!C137","v":0},{"$f":"IF(E138=0,0,IMPRIMIR!D137)","v":0},{"$f":"IF(E138=0,0,IMPRIMIR!E137)","v":0},0,0,0]
[null,{"$f":"IF(E139=0,0,IMPRIMIR!A138)","v":0},{"$f":"IF(E139=0,0,IMPRIMIR!$D$3)","v":0},0,{"$f":"IMPRIMIR!B138","v":0},{"$f":"IMPRIMIR!C138","v":0},{"$f":"IF(E139=0,0,IMPRIMIR!D138)","v":0},{"$f":"IF(E139=0,0,IMPRIMIR!E138)","v":0},0,0,0]
[null,{"$f":"IF(E140=0,0,IMPRIMIR!A139)","v":0},{"$f":"IF(E140=0,0,IMPRIMIR!$D$3)","v":0},0,{"$f":"IMPRIMIR!B139","v":0},{"$f":"IMPRIMIR!C139","v":0},{"$f":"IF(E140=0,0,IMPRIMIR!D139)","v":0},{"$f":"IF(E140=0,0,IMPRIMIR!E139)","v":0},0,0,0]
[null,{"$f":"IF(E141=0,0,IMPRIMIR!A140)","v":0},{"$f":"IF(E141=0,0,IMPRIMIR!$D$3)","v":0},0,{"$f":"IMPRIMIR!B140","v":0},{"$f":"IMPRIMIR!C140","v":0},{"$f":"IF(E141=0,0,IMPRIMIR!D140)","v":0},{"$f":"IF(E141=0,0,IMPRIMIR!E140)","v":0},0,0,0]
[null,{"$f":"IF(E142=0,0,IMPRIMIR!A141)","v":0},{"$f":"IF(E142=0,0,IMPRIMIR!$D$3)","v":0},0,{"$f":"IMPRIMIR!B141","v":0},{"$f":"IMPRIMIR!C141","v":0},{"$f":"IF(E142=0,0,IMPRIMIR!D141)","v":0},{"$f":"IF(E142=0,0,IMPRIMIR!E141)","v":0},0,0,0]
[null,{"$f":"IF(E143=0,0,IMPRIMIR!A142)","v":0},{"$f":"IF(E143=0,0,IMPRIMIR!$D$3)","v":0},0,{"$f":"IMPRIMIR!B142","v":0},{"$f":"IMPRIMIR!C142","v":0},{"$f":"IF(E143=0,0,IMPRIMIR!D142)","v":0},{"$f":"IF(E143=0,0,IMPRIMIR!E142)","v":0},0,0,0]
[null,{"$f":"IF(E144=0,0,IMPRIMIR!A143)","v":0},{"$f":"IF(E144=0,0,IMPRIMIR!$D$3)","v":0},0,{"$f":"IMPRIMIR!B143","v":0},{"$f":"IMPRIMIR!C143","v":0},{"$f":"IF(E144=0,0,IMPRIMIR!D143)","v":0},{"$f":"IF(E144=0,0,IMPRIMIR!E143)","v":0},0,0,0]
[null,{"$f":"IF(E145=0,0,IMPRIMIR!A144)","v":0},{"$f":"IF(E145=0,0,IMPRIMIR!$D$3)","v":0},0,{"$f":"IMPRIMIR!B144","v":0},{"$f":"IMPRIMIR!C144","v":0},{"$f":"IF(E145=0,0,IMPRIMIR!D144)","v":0},{"$f":"IF(E145=0,0,IMPRIMIR!E144)","v":0},0,0,0]
[null,{"$f":"IF(E146=0,0,IMPRIMIR!A145)","v":0},{"$f":"IF(E146=0,0,IMPRIMIR!$D$3)","v":0},0,{"$f":"IMPRIMIR!B145","v":0},{"$f":"IMPRIMIR!C145","v":0},{"$f":"IF(E146=0,0,IMPRIMIR!D145)","v":0},{"$f":"IF(E146=0,0,IMPRIMIR!E145)","v":0},0,0,0]
[null,{"$f":"IF(E147=0,0,IMPRIMIR!A146)","v":0},{"$f":"IF(E147=0,0,IMPRIMIR!$D$3)","v":0},0,{"$f":"IMPRIMIR!B146","v":0},{"$f":"IMPRIMIR!C146","v":0},{"$f":"IF(E147=0,0,IMPRIMIR!D146)","v":0},{"$f":"IF(E147=0,0,IMPRIMIR!E146)","v":0},0,0,0]
[null,{"$f":"IF(E148=0,0,IMPRIMIR!A147)","v":0},{"$f":"IF(E148=0,0,IMPRIMIR!$D$3)","v":0},0,{"$f":"IMPRIMIR!B147","v":0},{"$f":"IMPRIMIR!C147","v":0},{"$f":"IF(E148=0,0,IMPRIMIR!D147)","v":0},{"$f":"IF(E148=0,0,IMPRIMIR!E147)","v":0},0,0,0]
[null,{"$f":"IF(E149=0,0,IMPRIMIR!A148)","v":0},{"$f":"IF(E149=0,0,IMPRIMIR!$D$3)","v":0},0,{"$f":"IMPRIMIR!B148","v":0},{"$f":"IMPRIMIR!C148","v":0},{"$f":"IF(E149=0,0,IMPRIMIR!D148)","v":0},{"$f":"IF(E149=0,0,IMPRIMIR!E148)","v":0},0,0,0]
[null,{"$f":"IF(E150=0,0,IMPRIMIR!A149)","v":0},{"$f":"IF(E150=0,0,IMPRIMIR!$D$3)","v":0},0,{"$f":"IMPRIMIR!B149","v":0},{"$f":"IMPRIMIR!C149","v":0},{"$f":"IF(E150=0,0,IMPRIMIR!D149)","v":0},{"$f":"IF(E150=0,0,IMPRIMIR!E149)","v":0},0,0,0]
[null,{"$f":"IF(E151=0,0,IMPRIMIR!A150)","v":0},{"$f":"IF(E151=0,0,IMPRIMIR!$D$3)","v":0},0,{"$f":"IMPRIMIR!B150","v":0},{"$f":"IMPRIMIR!C150","v":0},{"$f":"IF(E151=0,0,IMPRIMIR!D150)","v":0},{"$f":"IF(E151=0,0,IMPRIMIR!E150)","v":0},0,0,0]
[null,{"$f":"IF(E152=0,0,IMPRIMIR!A151)","v":0},{"$f":"IF(E152=0,0,IMPRIMIR!$D$3)","v":0},0,{"$f":"IMPRIMIR!B151","v":0},{"$f":"IMPRIMIR!C151","v":0},{"$f":"IF(E152=0,0,IMPRIMIR!D151)","v":0},{"$f":"IF(E152=0,0,IMPRIMIR!E151)","v":0},0,0,0]
[null,{"$f":"IF(E153=0,0,IMPRIMIR!A152)","v":0},{"$f":"IF(E153=0,0,IMPRIMIR!$D$3)","v":0},0,{"$f":"IMPRIMIR!B152","v":0},{"$f":"IMPRIMIR!C152","v":0},{"$f":"IF(E153=0,0,IMPRIMIR!D152)","v":0},{"$f":"IF(E153=0,0,IMPRIMIR!E152)","v":0},0,0,0]
[null,{"$f":"IF(E154=0,0,IMPRIMIR!A153)","v":0},{"$f":"IF(E154=0,0,IMPRIMIR!$D$3)","v":0},0,{"$f":"IMPRIMIR!B153","v":0},{"$f":"IMPRIMIR!C153","v":0},{"$f":"IF(E154=0,0,IMPRIMIR!D153)","v":0},{"$f":"IF(E154=0,0,IMPRIMIR!E153)","v":0},0,0,0]
[null,{"$f":"IF(E155=0,0,IMPRIMIR!A154)","v":0},{"$f":"IF(E155=0,0,IMPRIMIR!$D$3)","v":0},0,{"$f":"IMPRIMIR!B154","v":0},{"$f":"IMPRIMIR!C154","v":0},{"$f":"IF(E155=0,0,IMPRIMIR!D154)","v":0},{"$f":"IF(E155=0,0,IMPRIMIR!E154)","v":0},0,0,0]
[null,{"$f":"IF(E156=0,0,IMPRIMIR!A155)","v":0},{"$f":"IF(E156=0,0,IMPRIMIR!$D$3)","v":0},0,{"$f":"IMPRIMIR!B155","v":0},{"$f":"IMPRIMIR!C155","v":0},{"$f":"IF(E156=0,0,IMPRIMIR!D155)","v":0},{"$f":"IF(E156=0,0,IMPRIMIR!E155)","v":0},0,0,0]
[null,{"$f":"IF(E157=0,0,IMPRIMIR!A156)","v":0},{"$f":"IF(E157=0,0,IMPRIMIR!$D$3)","v":0},0,{"$f":"IMPRIMIR!B156","v":0},{"$f":"IMPRIMIR!C156","v":0},{"$f":"IF(E157=0,0,IMPRIMIR!D156)","v":0},{"$f":"IF(E157=0,0,IMPRIMIR!E156)","v":0},0,0,0]
[null,{"$f":"IF(E158=0,0,IMPRIMIR!A157)","v":0},{"$f":"IF(E158=0,0,IMPRIMIR!$D$3)","v":0},0,{"$f":"IMPRIMIR!B157","v":0},{"$f":"IMPRIMIR!C157","v":0},{"$f":"IF(E158=0,0,IMPRIMIR!D157)","v":0},{"$f":"IF(E158=0,0,IMPRIMIR!E157)","v":0},0,0,0]
[null,{"$f":"IF(E159=0,0,IMPRIMIR!A158)","v":0},{"$f":"IF(E159=0,0,IMPRIMIR!$D$3)","v":0},0,{"$f":"IMPRIMIR!B158","v":0},{"$f":"IMPRIMIR!C158","v":0},{"$f":"IF(E159=0,0,IMPRIMIR!D158)","v":0},{"$f":"IF(E159=0,0,IMPRIMIR!E158)","v":0},0,0,0]
[null,{"$f":"IF(E160=0,0,IMPRIMIR!A159)","v":0},{"$f":"IF(E160=0,0,IMPRIMIR!$D$3)","v":0},0,{"$f":"IMPRIMIR!B159","v":0},{"$f":"IMPRIMIR!C159","v":0},{"$f":"IF(E160=0,0,IMPRIMIR!D159)","v":0},{"$f":"IF(E160=0,0,IMPRIMIR!E159)","v":0},0,0,0]
[null,{"$f":"IF(E161=0,0,IMPRIMIR!A160)","v":0},{"$f":"IF(E161=0,0,IMPRIMIR!$D$3)","v":0},0,{"$f":"IMPRIMIR!B160","v":0},{"$f":"IMPRIMIR!C160","v":0},{"$f":"IF(E161=0,0,IMPRIMIR!D160)","v":0},{"$f":"IF(E161=0,0,IMPRIMIR!E160)","v":0},0,0,0]
[null,{"$f":"IF(E162=0,0,IMPRIMIR!A161)","v":0},{"$f":"IF(E162=0,0,IMPRIMIR!$D$3)","v":0},0,{"$f":"IMPRIMIR!B161","v":0},{"$f":"IMPRIMIR!C161","v":0},{"$f":"IF(E162=0,0,IMPRIMIR!D161)","v":0},{"$f":"IF(E162=0,0,IMPRIMIR!E161)","v":0},0,0,0]
[null,{"$f":"IF(E163=0,0,IMPRIMIR!A162)","v":0},{"$f":"IF(E163=0,0,IMPRIMIR!$D$3)","v":0},0,{"$f":"IMPRIMIR!B162","v":0},{"$f":"IMPRIMIR!C162","v":0},{"$f":"IF(E163=0,0,IMPRIMIR!D162)","v":0},{"$f":"IF(E163=0,0,IMPRIMIR!E162)","v":0},0,0,0]
[null,{"$f":"IF(E164=0,0,IMPRIMIR!A163)","v":0},{"$f":"IF(E164=0,0,IMPRIMIR!$D$3)","v":0},0,{"$f":"IMPRIMIR!B163","v":0},{"$f":"IMPRIMIR!C163","v":0},{"$f":"IF(E164=0,0,IMPRIMIR!D163)","v":0},{"$f":"IF(E164=0,0,IMPRIMIR!E163)","v":0},0,0,0]
[null,{"$f":"IF(E165=0,0,IMPRIMIR!A164)","v":0},{"$f":"IF(E165=0,0,IMPRIMIR!$D$3)","v":0},0,{"$f":"IMPRIMIR!B164","v":0},{"$f":"IMPRIMIR!C164","v":0},{"$f":"IF(E165=0,0,IMPRIMIR!D164)","v":0},{"$f":"IF(E165=0,0,IMPRIMIR!E164)","v":0},0,0,0]
[null,{"$f":"IF(E166=0,0,IMPRIMIR!A165)","v":0},{"$f":"IF(E166=0,0,IMPRIMIR!$D$3)","v":0},0,{"$f":"IMPRIMIR!B165","v":0},{"$f":"IMPRIMIR!C165","v":0},{"$f":"IF(E166=0,0,IMPRIMIR!D165)","v":0},{"$f":"IF(E166=0,0,IMPRIMIR!E165)","v":0},0,0,0]
[null,{"$f":"IF(E167=0,0,IMPRIMIR!A166)","v":0},{"$f":"IF(E167=0,0,IMPRIMIR!$D$3)","v":0},0,{"$f":"IMPRIMIR!B166","v":0},{"$f":"IMPRIMIR!C166","v":0},{"$f":"IF(E167=0,0,IMPRIMIR!D166)","v":0},{"$f":"IF(E167=0,0,IMPRIMIR!E166)","v":0},0,0,0]
[null,{"$f":"IF(E168=0,0,IMPRIMIR!A167)","v":0},{"$f":"IF(E168=0,0,IMPRIMIR!$D$3)","v":0},0,{"$f":"IMPRIMIR!B167","v":0},{"$f":"IMPRIMIR!C167","v":0},{"$f":"IF(E168=0,0,IMPRIMIR!D167)","v":0},{"$f":"IF(E168=0,0,IMPRIMIR!E167)","v":0},0,0,0]
[null,{"$f":"IF(E169=0,0,IMPRIMIR!A168)","v":0},{"$f":"IF(E169=0,0,IMPRIMIR!$D$3)","v":0},0,{"$f":"IMPRIMIR!B168","v":0},{"$f":"IMPRIMIR!C168","v":0},{"$f":"IF(E169=0,0,IMPRIMIR!D168)","v":0},{"$f":"IF(E169=0,0,IMPRIMIR!E168)","v":0},0,0,0]
[null,{"$f":"IF(E170=0,0,IMPRIMIR!A169)","v":0},{"$f":"IF(E170=0,0,IMPRIMIR!$D$3)","v":0},0,{"$f":"IMPRIMIR!B169","v":0},{"$f":"IMPRIMIR!C169","v":0},{"$f":"IF(E170=0,0,IMPRIMIR!D169)","v":0},{"$f":"IF(E170=0,0,IMPRIMIR!E169)","v":0},0,0,0]
[null,{"$f":"IF(E171=0,0,IMPRIMIR!A170)","v":0},{"$f":"IF(E171=0,0,IMPRIMIR!$D$3)","v":0},0,{"$f":"IMPRIMIR!B170","v":0},{"$f":"IMPRIMIR!C170","v":0},{"$f":"IF(E171=0,0,IMPRIMIR!D170)","v":0},{"$f":"IF(E171=0,0,IMPRIMIR!E170)","v":0},0,0,0]
[null,{"$f":"IF(E172=0,0,IMPRIMIR!A171)","v":0},{"$f":"IF(E172=0,0,IMPRIMIR!$D$3)","v":0},0,{"$f":"IMPRIMIR!B171","v":0},{"$f":"IMPRIMIR!C171","v":0},{"$f":"IF(E172=0,0,IMPRIMIR!D171)","v":0},{"$f":"IF(E172=0,0,IMPRIMIR!E171)","v":0},0,0,0]
[null,{"$f":"IF(E173=0,0,IMPRIMIR!A172)","v":0},{"$f":"IF(E173=0,0,IMPRIMIR!$D$3)","v":0},0,{"$f":"IMPRIMIR!B172","v":0},{"$f":"IMPRIMIR!C172","v":0},{"$f":"IF(E173=0,0,IMPRIMIR!D172)","v":0},{"$f":"IF(E173=0,0,IMPRIMIR!E172)","v":0},0,0,0]
[null,{"$f":"IF(E174=0,0,IMPRIMIR!A173)","v":0},{"$f":"IF(E174=0,0,IMPRIMIR!$D$3)","v":0},0,{"$f":"IMPRIMIR!B173","v":0},{"$f":"IMPRIMIR!C173","v":0},{"$f":"IF(E174=0,0,IMPRIMIR!D173)","v":0},{"$f":"IF(E174=0,0,IMPRIMIR!E173)","v":0},0,0,0]
[null,{"$f":"IF(E175=0,0,IMPRIMIR!A174)","v":0},{"$f":"IF(E175=0,0,IMPRIMIR!$D$3)","v":0},0,{"$f":"IMPRIMIR!B174","v":0},{"$f":"IMPRIMIR!C174","v":0},{"$f":"IF(E175=0,0,IMPRIMIR!D174)","v":0},{"$f":"IF(E175=0,0,IMPRIMIR!E174)","v":0},0,0,0]
[null,{"$f":"IF(E176=0,0,IMPRIMIR!A175)","v":0},{"$f":"IF(E176=0,0,IMPRIMIR!$D$3)","v":0},0,{"$f":"IMPRIMIR!B175","v":0},{"$f":"IMPRIMIR!C175","v":0},{"$f":"IF(E176=0,0,IMPRIMIR!D175)","v":0},{"$f":"IF(E176=0,0,IMPRIMIR!E175)","v":0},0,0,0]
[null,{"$f":"IF(E177=0,0,IMPRIMIR!A176)","v":0},{"$f":"IF(E177=0,0,IMPRIMIR!$D$3)","v":0},0,{"$f":"IMPRIMIR!B176","v":0},{"$f":"IMPRIMIR!C176","v":0},{"$f":"IF(E177=0,0,IMPRIMIR!D176)","v":0},{"$f":"IF(E177=0,0,IMPRIMIR!E176)","v":0},0,0,0]
[null,{"$f":"IF(E178=0,0,IMPRIMIR!A177)","v":0},{"$f":"IF(E178=0,0,IMPRIMIR!$D$3)","v":0},0,{"$f":"IMPRIMIR!B177","v":0},{"$f":"IMPRIMIR!C177","v":0},{"$f":"IF(E178=0,0,IMPRIMIR!D177)","v":0},{"$f":"IF(E178=0,0,IMPRIMIR!E177)","v":0},0,0,0]
[null,{"$f":"IF(E179=0,0,IMPRIMIR!A178)","v":0},{"$f":"IF(E179=0,0,IMPRIMIR!$D$3)","v":0},0,{"$f":"IMPRIMIR!B178","v":0},{"$f":"IMPRIMIR!C178","v":0},{"$f":"IF(E179=0,0,IMPRIMIR!D178)","v":0},{"$f":"IF(E179=0,0,IMPRIMIR!E178)","v":0},0,0,0]
[null,{"$f":"IF(E180=0,0,IMPRIMIR!A179)","v":0},{"$f":"IF(E180=0,0,IMPRIMIR!$D$3)","v":0},0,{"$f":"IMPRIMIR!B179","v":0},{"$f":"IMPRIMIR!C179","v":0},{"$f":"IF(E180=0,0,IMPRIMIR!D179)","v":0},{"$f":"IF(E180=0,0,IMPRIMIR!E179)","v":0},0,0,0]
[null,{"$f":"IF(E181=0,0,IMPRIMIR!A180)","v":0},{"$f":"IF(E181=0,0,IMPRIMIR!$D$3)","v":0},0,{"$f":"IMPRIMIR!B180","v":0},{"$f":"IMPRIMIR!C180","v":0},{"$f":"IF(E181=0,0,IMPRIMIR!D180)","v":0},{"$f":"IF(E181=0,0,IMPRIMIR!E180)","v":0},0,0,0]
[null,{"$f":"IF(E182=0,0,IMPRIMIR!A181)","v":0},{"$f":"IF(E182=0,0,IMPRIMIR!$D$3)","v":0},0,{"$f":"IMPRIMIR!B181","v":0},{"$f":"IMPRIMIR!C181","v":0},{"$f":"IF(E182=0,0,IMPRIMIR!D181)","v":0},{"$f":"IF(E182=0,0,IMPRIMIR!E181)","v":0},0,0,0]
[null,{"$f":"IF(E183=0,0,IMPRIMIR!A182)","v":0},{"$f":"IF(E183=0,0,IMPRIMIR!$D$3)","v":0},0,{"$f":"IMPRIMIR!B182","v":0},{"$f":"IMPRIMIR!C182","v":0},{"$f":"IF(E183=0,0,IMPRIMIR!D182)","v":0},{"$f":"IF(E183=0,0,IMPRIMIR!E182)","v":0},0,0,0]
[null,{"$f":"IF(E184=0,0,IMPRIMIR!A183)","v":0},{"$f":"IF(E184=0,0,IMPRIMIR!$D$3)","v":0},0,{"$f":"IMPRIMIR!B183","v":0},{"$f":"IMPRIMIR!C183","v":0},{"$f":"IF(E184=0,0,IMPRIMIR!D183)","v":0},{"$f":"IF(E184=0,0,IMPRIMIR!E183)","v":0},0,0,0]
[null,{"$f":"IF(E185=0,0,IMPRIMIR!A184)","v":0},{"$f":"IF(E185=0,0,IMPRIMIR!$D$3)","v":0},0,{"$f":"IMPRIMIR!B184","v":0},{"$f":"IMPRIMIR!C184","v":0},{"$f":"IF(E185=0,0,IMPRIMIR!D184)","v":0},{"$f":"IF(E185=0,0,IMPRIMIR!E184)","v":0},0,0,0]
[null,{"$f":"IF(E186=0,0,IMPRIMIR!A185)","v":0},{"$f":"IF(E186=0,0,IMPRIMIR!$D$3)","v":0},0,{"$f":"IMPRIMIR!B185","v":0},{"$f":"IMPRIMIR!C185","v":0},{"$f":"IF(E186=0,0,IMPRIMIR!D185)","v":0},{"$f":"IF(E186=0,0,IMPRIMIR!E185)","v":0},0,0,0]
[null,{"$f":"IF(E187=0,0,IMPRIMIR!A186)","v":0},{"$f":"IF(E187=0,0,IMPRIMIR!$D$3)","v":0},0,{"$f":"IMPRIMIR!B186","v":0},{"$f":"IMPRIMIR!C186","v":0},{"$f":"IF(E187=0,0,IMPRIMIR!D186)","v":0},{"$f":"IF(E187=0,0,IMPRIMIR!E186)","v":0},0,0,0]
[null,{"$f":"IF(E188=0,0,IMPRIMIR!A187)","v":0},{"$f":"IF(E188=0,0,IMPRIMIR!$D$3)","v":0},0,{"$f":"IMPRIMIR!B187","v":0},{"$f":"IMPRIMIR!C187","v":0},{"$f":"IF(E188=0,0,IMPRIMIR!D187)","v":0},{"$f":"IF(E188=0,0,IMPRIMIR!E187)","v":0},0,0,0]
[null,{"$f":"IF(E189=0,0,IMPRIMIR!A188)","v":0},{"$f":"IF(E189=0,0,IMPRIMIR!$D$3)","v":0},0,{"$f":"IMPRIMIR!B188","v":0},{"$f":"IMPRIMIR!C188","v":0},{"$f":"IF(E189=0,0,IMPRIMIR!D188)","v":0},{"$f":"IF(E189=0,0,IMPRIMIR!E188)","v":0},0,0,0]
[null,{"$f":"IF(E190=0,0,IMPRIMIR!A189)","v":0},{"$f":"IF(E190=0,0,IMPRIMIR!$D$3)","v":0},0,{"$f":"IMPRIMIR!B189","v":0},{"$f":"IMPRIMIR!C189","v":0},{"$f":"IF(E190=0,0,IMPRIMIR!D189)","v":0},{"$f":"IF(E190=0,0,IMPRIMIR!E189)","v":0},0,0,0]
[null,{"$f":"IF(E191=0,0,IMPRIMIR!A190)","v":0},{"$f":"IF(E191=0,0,IMPRIMIR!$D$3)","v":0},0,{"$f":"IMPRIMIR!B190","v":0},{"$f":"IMPRIMIR!C190","v":0},{"$f":"IF(E191=0,0,IMPRIMIR!D190)","v":0},{"$f":"IF(E191=0,0,IMPRIMIR!E190)","v":0},0,0,0]
[null,{"$f":"IF(E192=0,0,IMPRIMIR!A191)","v":0},{"$f":"IF(E192=0,0,IMPRIMIR!$D$3)","v":0},0,{"$f":"IMPRIMIR!B191","v":0},{"$f":"IMPRIMIR!C191","v":0},{"$f":"IF(E192=0,0,IMPRIMIR!D191)","v":0},{"$f":"IF(E192=0,0,IMPRIMIR!E191)","v":0},0,0,0]
[null,{"$f":"IF(E193=0,0,IMPRIMIR!A192)","v":0},{"$f":"IF(E193=0,0,IMPRIMIR!$D$3)","v":0},0,{"$f":"IMPRIMIR!B192","v":0},{"$f":"IMPRIMIR!C192","v":0},{"$f":"IF(E193=0,0,IMPRIMIR!D192)","v":0},{"$f":"IF(E193=0,0,IMPRIMIR!E192)","v":0},0,0,0]
[null,{"$f":"IF(E194=0,0,IMPRIMIR!A193)","v":0},{"$f":"IF(E194=0,0,IMPRIMIR!$D$3)","v":0},0,{"$f":"IMPRIMIR!B193","v":0},{"$f":"IMPRIMIR!C193","v":0},{"$f":"IF(E194=0,0,IMPRIMIR!D193)","v":0},{"$f":"IF(E194=0,0,IMPRIMIR!E193)","v":0},0,0,0]
[null,{"$f":"IF(E195=0,0,IMPRIMIR!A194)","v":0},{"$f":"IF(E195=0,0,IMPRIMIR!$D$3)","v":0},0,{"$f":"IMPRIMIR!B194","v":0},{"$f":"IMPRIMIR!C194","v":0},{"$f":"IF(E195=0,0,IMPRIMIR!D194)","v":0},{"$f":"IF(E195=0,0,IMPRIMIR!E194)","v":0},0,0,0]
[null,{"$f":"IF(E196=0,0,IMPRIMIR!A195)","v":0},{"$f":"IF(E196=0,0,IMPRIMIR!$D$3)","v":0},0,{"$f":"IMPRIMIR!B195","v":0},{"$f":"IMPRIMIR!C195","v":0},{"$f":"IF(E196=0,0,IMPRIMIR!D195)","v":0},{"$f":"IF(E196=0,0,IMPRIMIR!E195)","v":0},0,0,0]
[null,{"$f":"IF(E197=0,0,IMPRIMIR!A196)","v":0},{"$f":"IF(E197=0,0,IMPRIMIR!$D$3)","v":0},0,{"$f":"IMPRIMIR!B196","v":0},{"$f":"IMPRIMIR!C196","v":0},{"$f":"IF(E197=0,0,IMPRIMIR!D196)","v":0},{"$f":"IF(E197=0,0,IMPRIMIR!E196)","v":0},0,0,0]
[null,{"$f":"IF(E198=0,0,IMPRIMIR!A197)","v":0},{"$f":"IF(E198=0,0,IMPRIMIR!$D$3)","v":0},0,{"$f":"IMPRIMIR!B197","v":0},{"$f":"IMPRIMIR!C197","v":0},{"$f":"IF(E198=0,0,IMPRIMIR!D197)","v":0},{"$f":"IF(E198=0,0,IMPRIMIR!E197)","v":0},0,0,0]
[null,{"$f":"IF(E199=0,0,IMPRIMIR!A198)","v":0},{"$f":"IF(E199=0,0,IMPRIMIR!$D$3)","v":0},0,{"$f":"IMPRIMIR!B198","v":0},{"$f":"IMPRIMIR!C198","v":0},{"$f":"IF(E199=0,0,IMPRIMIR!D198)","v":0},{"$f":"IF(E199=0,0,IMPRIMIR!E198)","v":0},0,0,0]
[null,{"$f":"IF(E200=0,0,IMPRIMIR!A199)","v":0},{"$f":"IF(E200=0,0,IMPRIMIR!$D$3)","v":0},0,{"$f":"IMPRIMIR!B199","v":0},{"$f":"IMPRIMIR!C199","v":0},{"$f":"IF(E200=0,0,IMPRIMIR!D199)","v":0},{"$f":"IF(E200=0,0,IMPRIMIR!E199)","v":0},0,0,0]
[null,{"$f":"IF(E201=0,0,IMPRIMIR!A200)","v":0},{"$f":"IF(E201=0,0,IMPRIMIR!$D$3)","v":0},{"$f":"IF(E201=\"0\",0,$G$2)","v":0},{"$f":"IMPRIMIR!B200","v":0},{"$f":"IMPRIMIR!C200","v":0},{"$f":"IF(E201=0,0,IMPRIMIR!D200)","v":0},{"$f":"IF(E201=0,0,IMPRIMIR!E200)","v":0},{"$f":"IF(E201=0,0,$G$2)","v":0},{"$f":"IF(E201=0,0,$G$4)","v":0},{"$f":"IF(E201=0,0,$G$3)","v":0}]
[null,{"$f":"IF(E202=0,0,IMPRIMIR!A201)","v":0},{"$f":"IF(E202=0,0,IMPRIMIR!$D$3)","v":0},0,{"$f":"IMPRIMIR!B201","v":0},{"$f":"IMPRIMIR!C201","v":0},{"$f":"IF(E202=0,0,IMPRIMIR!D201)","v":0},{"$f":"IF(E202=0,0,IMPRIMIR!E201)","v":0},0,0,0]
[null,{"$f":"IF(E203=0,0,IMPRIMIR!A202)","v":0},{"$f":"IF(E203=0,0,IMPRIMIR!$D$3)","v":0},0,{"$f":"IMPRIMIR!B202","v":0},{"$f":"IMPRIMIR!C202","v":0},{"$f":"IF(E203=0,0,IMPRIMIR!D202)","v":0},{"$f":"IF(E203=0,0,IMPRIMIR!E202)","v":0},0,0,0]
[null,{"$f":"IF(E204=0,0,IMPRIMIR!A203)","v":0},{"$f":"IF(E204=0,0,IMPRIMIR!$D$3)","v":0},0,{"$f":"IMPRIMIR!B203","v":0},{"$f":"IMPRIMIR!C203","v":0},{"$f":"IF(E204=0,0,IMPRIMIR!D203)","v":0},{"$f":"IF(E204=0,0,IMPRIMIR!E203)","v":0},0,0,0]
[null,{"$f":"IF(E205=0,0,IMPRIMIR!A204)","v":0},{"$f":"IF(E205=0,0,IMPRIMIR!$D$3)","v":0},0,{"$f":"IMPRIMIR!B204","v":0},{"$f":"IMPRIMIR!C204","v":0},{"$f":"IF(E205=0,0,IMPRIMIR!D204)","v":0},{"$f":"IF(E205=0,0,IMPRIMIR!E204)","v":0},0,0,0]
[null,{"$f":"IF(E206=0,0,IMPRIMIR!A205)","v":0},{"$f":"IF(E206=0,0,IMPRIMIR!$D$3)","v":0},0,{"$f":"IMPRIMIR!B205","v":0},{"$f":"IMPRIMIR!C205","v":0},{"$f":"IF(E206=0,0,IMPRIMIR!D205)","v":0},{"$f":"IF(E206=0,0,IMPRIMIR!E205)","v":0},0,0,0]
[null,{"$f":"IF(E207=0,0,IMPRIMIR!A206)","v":0},{"$f":"IF(E207=0,0,IMPRIMIR!$D$3)","v":0},0,{"$f":"IMPRIMIR!B206","v":0},{"$f":"IMPRIMIR!C206","v":0},{"$f":"IF(E207=0,0,IMPRIMIR!D206)","v":0},{"$f":"IF(E207=0,0,IMPRIMIR!E206)","v":0},0,0,0]
[null,{"$f":"IF(E208=0,0,IMPRIMIR!A207)","v":0},{"$f":"IF(E208=0,0,IMPRIMIR!$D$3)","v":0},0,{"$f":"IMPRIMIR!B207","v":0},{"$f":"IMPRIMIR!C207","v":0},{"$f":"IF(E208=0,0,IMPRIMIR!D207)","v":0},{"$f":"IF(E208=0,0,IMPRIMIR!E207)","v":0},0,0,0]
[null,{"$f":"IF(E209=0,0,IMPRIMIR!A208)","v":0},{"$f":"IF(E209=0,0,IMPRIMIR!$D$3)","v":0},0,{"$f":"IMPRIMIR!B208","v":0},{"$f":"IMPRIMIR!C208","v":0},{"$f":"IF(E209=0,0,IMPRIMIR!D208)","v":0},{"$f":"IF(E209=0,0,IMPRIMIR!E208)","v":0},0,0,0]
[null,{"$f":"IF(E210=0,0,IMPRIMIR!A209)","v":0},{"$f":"IF(E210=0,0,IMPRIMIR!$D$3)","v":0},0,{"$f":"IMPRIMIR!B209","v":0},{"$f":"IMPRIMIR!C209","v":0},{"$f":"IF(E210=0,0,IMPRIMIR!D209)","v":0},{"$f":"IF(E210=0,0,IMPRIMIR!E209)","v":0},0,0,0]
[null,{"$f":"IF(E211=0,0,IMPRIMIR!A210)","v":0},{"$f":"IF(E211=0,0,IMPRIMIR!$D$3)","v":0},0,{"$f":"IMPRIMIR!B210","v":0},{"$f":"IMPRIMIR!C210","v":0},{"$f":"IF(E211=0,0,IMPRIMIR!D210)","v":0},{"$f":"IF(E211=0,0,IMPRIMIR!E210)","v":0},0,0,0]
[null,{"$f":"IF(E212=0,0,IMPRIMIR!A211)","v":0},{"$f":"IF(E212=0,0,IMPRIMIR!$D$3)","v":0},0,{"$f":"IMPRIMIR!B211","v":0},{"$f":"IMPRIMIR!C211","v":0},{"$f":"IF(E212=0,0,IMPRIMIR!D211)","v":0},{"$f":"IF(E212=0,0,IMPRIMIR!E211)","v":0},0,0,0]
[null,{"$f":"IF(E213=0,0,IMPRIMIR!A212)","v":0},{"$f":"IF(E213=0,0,IMPRIMIR!$D$3)","v":0},0,{"$f":"IMPRIMIR!B212","v":0},{"$f":"IMPRIMIR!C212","v":0},{"$f":"IF(E213=0,0,IMPRIMIR!D212)","v":0},{"$f":"IF(E213=0,0,IMPRIMIR!E212)","v":0},0,0,0]
[null,{"$f":"IF(E214=0,0,IMPRIMIR!A213)","v":0},{"$f":"IF(E214=0,0,IMPRIMIR!$D$3)","v":0},0,{"$f":"IMPRIMIR!B213","v":0},{"$f":"IMPRIMIR!C213","v":0},{"$f":"IF(E214=0,0,IMPRIMIR!D213)","v":0},{"$f":"IF(E214=0,0,IMPRIMIR!E213)","v":0},0,0,0]
[null,{"$f":"IF(E215=0,0,IMPRIMIR!A214)","v":0},{"$f":"IF(E215=0,0,IMPRIMIR!$D$3)","v":0},0,{"$f":"IMPRIMIR!B214","v":0},{"$f":"IMPRIMIR!C214","v":0},{"$f":"IF(E215=0,0,IMPRIMIR!D214)","v":0},{"$f":"IF(E215=0,0,IMPRIMIR!E214)","v":0},0,0,0]
[null,{"$f":"IF(E216=0,0,IMPRIMIR!A215)","v":0},{"$f":"IF(E216=0,0,IMPRIMIR!$D$3)","v":0},0,{"$f":"IMPRIMIR!B215","v":0},{"$f":"IMPRIMIR!C215","v":0},{"$f":"IF(E216=0,0,IMPRIMIR!D215)","v":0},{"$f":"IF(E216=0,0,IMPRIMIR!E215)","v":0},0,0,0]
[null,{"$f":"IF(E217=0,0,IMPRIMIR!A216)","v":0},{"$f":"IF(E217=0,0,IMPRIMIR!$D$3)","v":0},0,{"$f":"IMPRIMIR!B216","v":0},{"$f":"IMPRIMIR!C216","v":0},{"$f":"IF(E217=0,0,IMPRIMIR!D216)","v":0},{"$f":"IF(E217=0,0,IMPRIMIR!E216)","v":0},0,0,0]
[null,{"$f":"IF(E218=0,0,IMPRIMIR!A217)","v":0},{"$f":"IF(E218=0,0,IMPRIMIR!$D$3)","v":0},0,{"$f":"IMPRIMIR!B217","v":0},{"$f":"IMPRIMIR!C217","v":0},{"$f":"IF(E218=0,0,IMPRIMIR!D217)","v":0},{"$f":"IF(E218=0,0,IMPRIMIR!E217)","v":0},0,0,0]
[null,{"$f":"IF(E219=0,0,IMPRIMIR!A218)","v":0},{"$f":"IF(E219=0,0,IMPRIMIR!$D$3)","v":0},0,{"$f":"IMPRIMIR!B218","v":0},{"$f":"IMPRIMIR!C218","v":0},{"$f":"IF(E219=0,0,IMPRIMIR!D218)","v":0},{"$f":"IF(E219=0,0,IMPRIMIR!E218)","v":0},0,0,0]
[null,{"$f":"IF(E220=0,0,IMPRIMIR!A219)","v":0},{"$f":"IF(E220=0,0,IMPRIMIR!$D$3)","v":0},0,{"$f":"IMPRIMIR!B219","v":0},{"$f":"IMPRIMIR!C219","v":0},{"$f":"IF(E220=0,0,IMPRIMIR!D219)","v":0},{"$f":"IF(E220=0,0,IMPRIMIR!E219)","v":0},0,0,0]
[null,{"$f":"IF(E221=0,0,IMPRIMIR!A220)","v":0},{"$f":"IF(E221=0,0,IMPRIMIR!$D$3)","v":0},0,{"$f":"IMPRIMIR!B220","v":0},{"$f":"IMPRIMIR!C220","v":0},{"$f":"IF(E221=0,0,IMPRIMIR!D220)","v":0},{"$f":"IF(E221=0,0,IMPRIMIR!E220)","v":0},0,0,0]
[null,{"$f":"IF(E222=0,0,IMPRIMIR!A221)","v":0},{"$f":"IF(E222=0,0,IMPRIMIR!$D$3)","v":0},0,{"$f":"IMPRIMIR!B221","v":0},{"$f":"IMPRIMIR!C221","v":0},{"$f":"IF(E222=0,0,IMPRIMIR!D221)","v":0},{"$f":"IF(E222=0,0,IMPRIMIR!E221)","v":0},0,0,0]
[null,{"$f":"IF(E223=0,0,IMPRIMIR!A222)","v":0},{"$f":"IF(E223=0,0,IMPRIMIR!$D$3)","v":0},0,{"$f":"IMPRIMIR!B222","v":0},{"$f":"IMPRIMIR!C222","v":0},{"$f":"IF(E223=0,0,IMPRIMIR!D222)","v":0},{"$f":"IF(E223=0,0,IMPRIMIR!E222)","v":0},0,0,0]
[null,{"$f":"IF(E224=0,0,IMPRIMIR!A223)","v":0},{"$f":"IF(E224=0,0,IMPRIMIR!$D$3)","v":0},0,{"$f":"IMPRIMIR!B223","v":0},{"$f":"IMPRIMIR!C223","v":0},{"$f":"IF(E224=0,0,IMPRIMIR!D223)","v":0},{"$f":"IF(E224=0,0,IMPRIMIR!E223)","v":0},0,0,0]
[null,{"$f":"IF(E225=0,0,IMPRIMIR!A224)","v":0},{"$f":"IF(E225=0,0,IMPRIMIR!$D$3)","v":0},0,{"$f":"IMPRIMIR!B224","v":0},{"$f":"IMPRIMIR!C224","v":0},{"$f":"IF(E225=0,0,IMPRIMIR!D224)","v":0},{"$f":"IF(E225=0,0,IMPRIMIR!E224)","v":0},0,0,0]
[null,{"$f":"IF(E226=0,0,IMPRIMIR!A225)","v":0},{"$f":"IF(E226=0,0,IMPRIMIR!$D$3)","v":0},0,{"$f":"IMPRIMIR!B225","v":0},{"$f":"IMPRIMIR!C225","v":0},{"$f":"IF(E226=0,0,IMPRIMIR!D225)","v":0},{"$f":"IF(E226=0,0,IMPRIMIR!E225)","v":0},0,0,0]
[null,{"$f":"IF(E227=0,0,IMPRIMIR!A226)","v":0},{"$f":"IF(E227=0,0,IMPRIMIR!$D$3)","v":0},0,{"$f":"IMPRIMIR!B226","v":0},{"$f":"IMPRIMIR!C226","v":0},{"$f":"IF(E227=0,0,IMPRIMIR!D226)","v":0},{"$f":"IF(E227=0,0,IMPRIMIR!E226)","v":0},0,0,0]
[null,{"$f":"IF(E228=0,0,IMPRIMIR!A227)","v":0},{"$f":"IF(E228=0,0,IMPRIMIR!$D$3)","v":0},0,{"$f":"IMPRIMIR!B227","v":0},{"$f":"IMPRIMIR!C227","v":0},{"$f":"IF(E228=0,0,IMPRIMIR!D227)","v":0},{"$f":"IF(E228=0,0,IMPRIMIR!E227)","v":0},0,0,0]
[null,{"$f":"IF(E229=0,0,IMPRIMIR!A228)","v":0},{"$f":"IF(E229=0,0,IMPRIMIR!$D$3)","v":0},0,{"$f":"IMPRIMIR!B228","v":0},{"$f":"IMPRIMIR!C228","v":0},{"$f":"IF(E229=0,0,IMPRIMIR!D228)","v":0},{"$f":"IF(E229=0,0,IMPRIMIR!E228)","v":0},0,0,0]
[null,{"$f":"IF(E230=0,0,IMPRIMIR!A229)","v":0},{"$f":"IF(E230=0,0,IMPRIMIR!$D$3)","v":0},0,{"$f":"IMPRIMIR!B229","v":0},{"$f":"IMPRIMIR!C229","v":0},{"$f":"IF(E230=0,0,IMPRIMIR!D229)","v":0},{"$f":"IF(E230=0,0,IMPRIMIR!E229)","v":0},0,0,0]
[null,{"$f":"IF(E231=0,0,IMPRIMIR!A230)","v":0},{"$f":"IF(E231=0,0,IMPRIMIR!$D$3)","v":0},0,{"$f":"IMPRIMIR!B230","v":0},{"$f":"IMPRIMIR!C230","v":0},{"$f":"IF(E231=0,0,IMPRIMIR!D230)","v":0},{"$f":"IF(E231=0,0,IMPRIMIR!E230)","v":0},0,0,0]
[null,{"$f":"IF(E232=0,0,IMPRIMIR!A231)","v":0},{"$f":"IF(E232=0,0,IMPRIMIR!$D$3)","v":0},0,{"$f":"IMPRIMIR!B231","v":0},{"$f":"IMPRIMIR!C231","v":0},{"$f":"IF(E232=0,0,IMPRIMIR!D231)","v":0},{"$f":"IF(E232=0,0,IMPRIMIR!E231)","v":0},0,0,0]
[null,{"$f":"IF(E233=0,0,IMPRIMIR!A232)","v":0},{"$f":"IF(E233=0,0,IMPRIMIR!$D$3)","v":0},0,{"$f":"IMPRIMIR!B232","v":0},{"$f":"IMPRIMIR!C232","v":0},{"$f":"IF(E233=0,0,IMPRIMIR!D232)","v":0},{"$f":"IF(E233=0,0,IMPRIMIR!E232)","v":0},0,0,0]
[null,{"$f":"IF(E234=0,0,IMPRIMIR!A233)","v":0},{"$f":"IF(E234=0,0,IMPRIMIR!$D$3)","v":0},0,{"$f":"IMPRIMIR!B233","v":0},{"$f":"IMPRIMIR!C233","v":0},{"$f":"IF(E234=0,0,IMPRIMIR!D233)","v":0},{"$f":"IF(E234=0,0,IMPRIMIR!E233)","v":0},0,0,0]
[null,{"$f":"IF(E235=0,0,IMPRIMIR!A234)","v":0},{"$f":"IF(E235=0,0,IMPRIMIR!$D$3)","v":0},0,{"$f":"IMPRIMIR!B234","v":0},{"$f":"IMPRIMIR!C234","v":0},{"$f":"IF(E235=0,0,IMPRIMIR!D234)","v":0},{"$f":"IF(E235=0,0,IMPRIMIR!E234)","v":0},0,0,0]
[null,{"$f":"IF(E236=0,0,IMPRIMIR!A235)","v":0},{"$f":"IF(E236=0,0,IMPRIMIR!$D$3)","v":0},0,{"$f":"IMPRIMIR!B235","v":0},{"$f":"IMPRIMIR!C235","v":0},{"$f":"IF(E236=0,0,IMPRIMIR!D235)","v":0},{"$f":"IF(E236=0,0,IMPRIMIR!E235)","v":0},0,0,0]
[null,{"$f":"IF(E237=0,0,IMPRIMIR!A236)","v":0},{"$f":"IF(E237=0,0,IMPRIMIR!$D$3)","v":0},0,{"$f":"IMPRIMIR!B236","v":0},{"$f":"IMPRIMIR!C236","v":0},{"$f":"IF(E237=0,0,IMPRIMIR!D236)","v":0},{"$f":"IF(E237=0,0,IMPRIMIR!E236)","v":0},0,0,0]
[null,{"$f":"IF(E238=0,0,IMPRIMIR!A237)","v":0},{"$f":"IF(E238=0,0,IMPRIMIR!$D$3)","v":0},0,{"$f":"IMPRIMIR!B237","v":0},{"$f":"IMPRIMIR!C237","v":0},{"$f":"IF(E238=0,0,IMPRIMIR!D237)","v":0},{"$f":"IF(E238=0,0,IMPRIMIR!E237)","v":0},0,0,0]
[null,{"$f":"IF(E239=0,0,IMPRIMIR!A238)","v":0},{"$f":"IF(E239=0,0,IMPRIMIR!$D$3)","v":0},0,{"$f":"IMPRIMIR!B238","v":0},{"$f":"IMPRIMIR!C238","v":0},{"$f":"IF(E239=0,0,IMPRIMIR!D238)","v":0},{"$f":"IF(E239=0,0,IMPRIMIR!E238)","v":0},0,0,0]
[null,{"$f":"IF(E240=0,0,IMPRIMIR!A239)","v":0},{"$f":"IF(E240=0,0,IMPRIMIR!$D$3)","v":0},0,{"$f":"IMPRIMIR!B239","v":0},{"$f":"IMPRIMIR!C239","v":0},{"$f":"IF(E240=0,0,IMPRIMIR!D239)","v":0},{"$f":"IF(E240=0,0,IMPRIMIR!E239)","v":0},0,0,0]
[null,{"$f":"IF(E241=0,0,IMPRIMIR!A240)","v":0},{"$f":"IF(E241=0,0,IMPRIMIR!$D$3)","v":0},0,{"$f":"IMPRIMIR!B240","v":0},{"$f":"IMPRIMIR!C240","v":0},{"$f":"IF(E241=0,0,IMPRIMIR!D240)","v":0},{"$f":"IF(E241=0,0,IMPRIMIR!E240)","v":0},0,0,0]
[null,{"$f":"IF(E242=0,0,IMPRIMIR!A241)","v":0},{"$f":"IF(E242=0,0,IMPRIMIR!$D$3)","v":0},0,{"$f":"IMPRIMIR!B241","v":0},{"$f":"IMPRIMIR!C241","v":0},{"$f":"IF(E242=0,0,IMPRIMIR!D241)","v":0},{"$f":"IF(E242=0,0,IMPRIMIR!E241)","v":0},0,0,0]
[null,{"$f":"IF(E243=0,0,IMPRIMIR!A242)","v":0},{"$f":"IF(E243=0,0,IMPRIMIR!$D$3)","v":0},0,{"$f":"IMPRIMIR!B242","v":0},{"$f":"IMPRIMIR!C242","v":0},{"$f":"IF(E243=0,0,IMPRIMIR!D242)","v":0},{"$f":"IF(E243=0,0,IMPRIMIR!E242)","v":0},0,0,0]
[null,{"$f":"IF(E244=0,0,IMPRIMIR!A243)","v":0},{"$f":"IF(E244=0,0,IMPRIMIR!$D$3)","v":0},0,{"$f":"IMPRIMIR!B243","v":0},{"$f":"IMPRIMIR!C243","v":0},{"$f":"IF(E244=0,0,IMPRIMIR!D243)","v":0},{"$f":"IF(E244=0,0,IMPRIMIR!E243)","v":0},0,0,0]
[null,{"$f":"IF(E245=0,0,IMPRIMIR!A244)","v":0},{"$f":"IF(E245=0,0,IMPRIMIR!$D$3)","v":0},0,{"$f":"IMPRIMIR!B244","v":0},{"$f":"IMPRIMIR!C244","v":0},{"$f":"IF(E245=0,0,IMPRIMIR!D244)","v":0},{"$f":"IF(E245=0,0,IMPRIMIR!E244)","v":0},0,0,0]
[null,{"$f":"IF(E246=0,0,IMPRIMIR!A245)","v":0},{"$f":"IF(E246=0,0,IMPRIMIR!$D$3)","v":0},0,{"$f":"IMPRIMIR!B245","v":0},{"$f":"IMPRIMIR!C245","v":0},{"$f":"IF(E246=0,0,IMPRIMIR!D245)","v":0},{"$f":"IF(E246=0,0,IMPRIMIR!E245)","v":0},0,0,0]
[null,{"$f":"IF(E247=0,0,IMPRIMIR!A246)","v":0},{"$f":"IF(E247=0,0,IMPRIMIR!$D$3)","v":0},0,{"$f":"IMPRIMIR!B246","v":0},{"$f":"IMPRIMIR!C246","v":0},{"$f":"IF(E247=0,0,IMPRIMIR!D246)","v":0},{"$f":"IF(E247=0,0,IMPRIMIR!E246)","v":0},0,0,0]
[null,{"$f":"IF(E248=0,0,IMPRIMIR!A247)","v":0},{"$f":"IF(E248=0,0,IMPRIMIR!$D$3)","v":0},0,{"$f":"IMPRIMIR!B247","v":0},{"$f":"IMPRIMIR!C247","v":0},{"$f":"IF(E248=0,0,IMPRIMIR!D247)","v":0},{"$f":"IF(E248=0,0,IMPRIMIR!E247)","v":0},0,0,0]
[null,{"$f":"IF(E249=0,0,IMPRIMIR!A248)","v":0},{"$f":"IF(E249=0,0,IMPRIMIR!$D$3)","v":0},0,{"$f":"IMPRIMIR!B248","v":0},{"$f":"IMPRIMIR!C248","v":0},{"$f":"IF(E249=0,0,IMPRIMIR!D248)","v":0},{"$f":"IF(E249=0,0,IMPRIMIR!E248)","v":0},0,0,0]
[null,{"$f":"IF(E250=0,0,IMPRIMIR!A249)","v":0},{"$f":"IF(E250=0,0,IMPRIMIR!$D$3)","v":0},0,{"$f":"IMPRIMIR!B249","v":0},{"$f":"IMPRIMIR!C249","v":0},{"$f":"IF(E250=0,0,IMPRIMIR!D249)","v":0},{"$f":"IF(E250=0,0,IMPRIMIR!E249)","v":0},0,0,0]
[null,{"$f":"IF(E251=0,0,IMPRIMIR!A250)","v":0},{"$f":"IF(E251=0,0,IMPRIMIR!$D$3)","v":0},0,{"$f":"IMPRIMIR!B250","v":0},{"$f":"IMPRIMIR!C250","v":0},{"$f":"IF(E251=0,0,IMPRIMIR!D250)","v":0},{"$f":"IF(E251=0,0,IMPRIMIR!E250)","v":0},0,0,0]
[null,{"$f":"IF(E252=0,0,IMPRIMIR!A251)","v":0},{"$f":"IF(E252=0,0,IMPRIMIR!$D$3)","v":0},0,{"$f":"IMPRIMIR!B251","v":0},{"$f":"IMPRIMIR!C251","v":0},{"$f":"IF(E252=0,0,IMPRIMIR!D251)","v":0},{"$f":"IF(E252=0,0,IMPRIMIR!E251)","v":0},0,0,0]
[null,{"$f":"IF(E253=0,0,IMPRIMIR!A252)","v":0},{"$f":"IF(E253=0,0,IMPRIMIR!$D$3)","v":0},0,{"$f":"IMPRIMIR!B252","v":0},{"$f":"IMPRIMIR!C252","v":0},{"$f":"IF(E253=0,0,IMPRIMIR!D252)","v":0},{"$f":"IF(E253=0,0,IMPRIMIR!E252)","v":0},0,0,0]
[null,{"$f":"IF(E254=0,0,IMPRIMIR!A253)","v":0},{"$f":"IF(E254=0,0,IMPRIMIR!$D$3)","v":0},0,{"$f":"IMPRIMIR!B253","v":0},{"$f":"IMPRIMIR!C253","v":0},{"$f":"IF(E254=0,0,IMPRIMIR!D253)","v":0},{"$f":"IF(E254=0,0,IMPRIMIR!E253)","v":0},0,0,0]
[null,{"$f":"IF(E255=0,0,IMPRIMIR!A254)","v":0},{"$f":"IF(E255=0,0,IMPRIMIR!$D$3)","v":0},0,{"$f":"IMPRIMIR!B254","v":0},{"$f":"IMPRIMIR!C254","v":0},{"$f":"IF(E255=0,0,IMPRIMIR!D254)","v":0},{"$f":"IF(E255=0,0,IMPRIMIR!E254)","v":0},0,0,0]
[null,{"$f":"IF(E256=0,0,IMPRIMIR!A255)","v":0},{"$f":"IF(E256=0,0,IMPRIMIR!$D$3)","v":0},0,{"$f":"IMPRIMIR!B255","v":0},{"$f":"IMPRIMIR!C255","v":0},{"$f":"IF(E256=0,0,IMPRIMIR!D255)","v":0},{"$f":"IF(E256=0,0,IMPRIMIR!E255)","v":0},0,0,0]
[null,{"$f":"IF(E257=0,0,IMPRIMIR!A256)","v":0},{"$f":"IF(E257=0,0,IMPRIMIR!$D$3)","v":0},0,{"$f":"IMPRIMIR!B256","v":0},{"$f":"IMPRIMIR!C256","v":0},{"$f":"IF(E257=0,0,IMPRIMIR!D256)","v":0},{"$f":"IF(E257=0,0,IMPRIMIR!E256)","v":0},0,0,0]
[null,{"$f":"IF(E258=0,0,IMPRIMIR!A257)","v":0},{"$f":"IF(E258=0,0,IMPRIMIR!$D$3)","v":0},0,{"$f":"IMPRIMIR!B257","v":0},{"$f":"IMPRIMIR!C257","v":0},{"$f":"IF(E258=0,0,IMPRIMIR!D257)","v":0},{"$f":"IF(E258=0,0,IMPRIMIR!E257)","v":0},0,0,0]
[null,{"$f":"IF(E259=0,0,IMPRIMIR!A258)","v":0},{"$f":"IF(E259=0,0,IMPRIMIR!$D$3)","v":0},0,{"$f":"IMPRIMIR!B258","v":0},{"$f":"IMPRIMIR!C258","v":0},{"$f":"IF(E259=0,0,IMPRIMIR!D258)","v":0},{"$f":"IF(E259=0,0,IMPRIMIR!E258)","v":0},0,0,0]
[null,{"$f":"IF(E260=0,0,IMPRIMIR!A259)","v":0},{"$f":"IF(E260=0,0,IMPRIMIR!$D$3)","v":0},0,{"$f":"IMPRIMIR!B259","v":0},{"$f":"IMPRIMIR!C259","v":0},{"$f":"IF(E260=0,0,IMPRIMIR!D259)","v":0},{"$f":"IF(E260=0,0,IMPRIMIR!E259)","v":0},0,0,0]
[null,{"$f":"IF(E261=0,0,IMPRIMIR!A260)","v":0},{"$f":"IF(E261=0,0,IMPRIMIR!$D$3)","v":0},0,{"$f":"IMPRIMIR!B260","v":0},{"$f":"IMPRIMIR!C260","v":0},{"$f":"IF(E261=0,0,IMPRIMIR!D260)","v":0},{"$f":"IF(E261=0,0,IMPRIMIR!E260)","v":0},0,0,0]
[null,{"$f":"IF(E262=0,0,IMPRIMIR!A261)","v":0},{"$f":"IF(E262=0,0,IMPRIMIR!$D$3)","v":0},0,{"$f":"IMPRIMIR!B261","v":0},{"$f":"IMPRIMIR!C261","v":0},{"$f":"IF(E262=0,0,IMPRIMIR!D261)","v":0},{"$f":"IF(E262=0,0,IMPRIMIR!E261)","v":0},0,0,0]
[null,{"$f":"IF(E263=0,0,IMPRIMIR!A262)","v":0},{"$f":"IF(E263=0,0,IMPRIMIR!$D$3)","v":0},0,{"$f":"IMPRIMIR!B262","v":0},{"$f":"IMPRIMIR!C262","v":0},{"$f":"IF(E263=0,0,IMPRIMIR!D262)","v":0},{"$f":"IF(E263=0,0,IMPRIMIR!E262)","v":0},0,0,0]
[null,{"$f":"IF(E264=0,0,IMPRIMIR!A263)","v":0},{"$f":"IF(E264=0,0,IMPRIMIR!$D$3)","v":0},0,{"$f":"IMPRIMIR!B263","v":0},{"$f":"IMPRIMIR!C263","v":0},{"$f":"IF(E264=0,0,IMPRIMIR!D263)","v":0},{"$f":"IF(E264=0,0,IMPRIMIR!E263)","v":0},0,0,0]
[null,{"$f":"IF(E265=0,0,IMPRIMIR!A264)","v":0},{"$f":"IF(E265=0,0,IMPRIMIR!$D$3)","v":0},{"$f":"IF(E265=\"0\",0,$G$2)","v":0},{"$f":"IMPRIMIR!B264","v":0},{"$f":"IMPRIMIR!C264","v":0},{"$f":"IF(E265=0,0,IMPRIMIR!D264)","v":0},{"$f":"IF(E265=0,0,IMPRIMIR!E264)","v":0},{"$f":"IF(E265=0,0,$G$2)","v":0},{"$f":"IF(E265=0,0,$G$4)","v":0},{"$f":"IF(E265=0,0,$G$3)","v":0}]
[null,{"$f":"IF(E266=0,0,IMPRIMIR!A265)","v":0},{"$f":"IF(E266=0,0,IMPRIMIR!$D$3)","v":0},0,{"$f":"IMPRIMIR!B265","v":0},{"$f":"IMPRIMIR!C265","v":0},{"$f":"IF(E266=0,0,IMPRIMIR!D265)","v":0},{"$f":"IF(E266=0,0,IMPRIMIR!E265)","v":0},0,0,0]
[null,{"$f":"IF(E267=0,0,IMPRIMIR!A266)","v":0},{"$f":"IF(E267=0,0,IMPRIMIR!$D$3)","v":0},0,{"$f":"IMPRIMIR!B266","v":0},{"$f":"IMPRIMIR!C266","v":0},{"$f":"IF(E267=0,0,IMPRIMIR!D266)","v":0},{"$f":"IF(E267=0,0,IMPRIMIR!E266)","v":0},0,0,0]
[null,{"$f":"IF(E268=0,0,IMPRIMIR!A267)","v":0},{"$f":"IF(E268=0,0,IMPRIMIR!$D$3)","v":0},0,{"$f":"IMPRIMIR!B267","v":0},{"$f":"IMPRIMIR!C267","v":0},{"$f":"IF(E268=0,0,IMPRIMIR!D267)","v":0},{"$f":"IF(E268=0,0,IMPRIMIR!E267)","v":0},0,0,0]
[null,{"$f":"IF(E269=0,0,IMPRIMIR!A268)","v":0},{"$f":"IF(E269=0,0,IMPRIMIR!$D$3)","v":0},0,{"$f":"IMPRIMIR!B268","v":0},{"$f":"IMPRIMIR!C268","v":0},{"$f":"IF(E269=0,0,IMPRIMIR!D268)","v":0},{"$f":"IF(E269=0,0,IMPRIMIR!E268)","v":0},0,0,0]
[null,{"$f":"IF(E270=0,0,IMPRIMIR!A269)","v":0},{"$f":"IF(E270=0,0,IMPRIMIR!$D$3)","v":0},0,{"$f":"IMPRIMIR!B269","v":0},{"$f":"IMPRIMIR!C269","v":0},{"$f":"IF(E270=0,0,IMPRIMIR!D269)","v":0},{"$f":"IF(E270=0,0,IMPRIMIR!E269)","v":0},0,0,0]
[null,{"$f":"IF(E271=0,0,IMPRIMIR!A270)","v":0},{"$f":"IF(E271=0,0,IMPRIMIR!$D$3)","v":0},0,{"$f":"IMPRIMIR!B270","v":0},{"$f":"IMPRIMIR!C270","v":0},{"$f":"IF(E271=0,0,IMPRIMIR!D270)","v":0},{"$f":"IF(E271=0,0,IMPRIMIR!E270)","v":0},0,0,0]
[null,{"$f":"IF(E272=0,0,IMPRIMIR!A271)","v":0},{"$f":"IF(E272=0,0,IMPRIMIR!$D$3)","v":0},0,{"$f":"IMPRIMIR!B271","v":0},{"$f":"IMPRIMIR!C271","v":0},{"$f":"IF(E272=0,0,IMPRIMIR!D271)","v":0},{"$f":"IF(E272=0,0,IMPRIMIR!E271)","v":0},0,0,0]
[null,{"$f":"IF(E273=0,0,IMPRIMIR!A272)","v":0},{"$f":"IF(E273=0,0,IMPRIMIR!$D$3)","v":0},0,{"$f":"IMPRIMIR!B272","v":0},{"$f":"IMPRIMIR!C272","v":0},{"$f":"IF(E273=0,0,IMPRIMIR!D272)","v":0},{"$f":"IF(E273=0,0,IMPRIMIR!E272)","v":0},0,0,0]
[null,{"$f":"IF(E274=0,0,IMPRIMIR!A273)","v":0},{"$f":"IF(E274=0,0,IMPRIMIR!$D$3)","v":0},0,{"$f":"IMPRIMIR!B273","v":0},{"$f":"IMPRIMIR!C273","v":0},{"$f":"IF(E274=0,0,IMPRIMIR!D273)","v":0},{"$f":"IF(E274=0,0,IMPRIMIR!E273)","v":0},0,0,0]
[null,{"$f":"IF(E275=0,0,IMPRIMIR!A274)","v":0},{"$f":"IF(E275=0,0,IMPRIMIR!$D$3)","v":0},0,{"$f":"IMPRIMIR!B274","v":0},{"$f":"IMPRIMIR!C274","v":0},{"$f":"IF(E275=0,0,IMPRIMIR!D274)","v":0},{"$f":"IF(E275=0,0,IMPRIMIR!E274)","v":0},0,0,0]
[null,{"$f":"IF(E276=0,0,IMPRIMIR!A275)","v":0},{"$f":"IF(E276=0,0,IMPRIMIR!$D$3)","v":0},0,{"$f":"IMPRIMIR!B275","v":0},{"$f":"IMPRIMIR!C275","v":0},{"$f":"IF(E276=0,0,IMPRIMIR!D275)","v":0},{"$f":"IF(E276=0,0,IMPRIMIR!E275)","v":0},0,0,0]
[null,{"$f":"IF(E277=0,0,IMPRIMIR!A276)","v":0},{"$f":"IF(E277=0,0,IMPRIMIR!$D$3)","v":0},0,{"$f":"IMPRIMIR!B276","v":0},{"$f":"IMPRIMIR!C276","v":0},{"$f":"IF(E277=0,0,IMPRIMIR!D276)","v":0},{"$f":"IF(E277=0,0,IMPRIMIR!E276)","v":0},0,0,0]
[null,{"$f":"IF(E278=0,0,IMPRIMIR!A277)","v":0},{"$f":"IF(E278=0,0,IMPRIMIR!$D$3)","v":0},0,{"$f":"IMPRIMIR!B277","v":0},{"$f":"IMPRIMIR!C277","v":0},{"$f":"IF(E278=0,0,IMPRIMIR!D277)","v":0},{"$f":"IF(E278=0,0,IMPRIMIR!E277)","v":0},0,0,0]
[null,{"$f":"IF(E279=0,0,IMPRIMIR!A278)","v":0},{"$f":"IF(E279=0,0,IMPRIMIR!$D$3)","v":0},0,{"$f":"IMPRIMIR!B278","v":0},{"$f":"IMPRIMIR!C278","v":0},{"$f":"IF(E279=0,0,IMPRIMIR!D278)","v":0},{"$f":"IF(E279=0,0,IMPRIMIR!E278)","v":0},0,0,0]
[null,{"$f":"IF(E280=0,0,IMPRIMIR!A279)","v":0},{"$f":"IF(E280=0,0,IMPRIMIR!$D$3)","v":0},0,{"$f":"IMPRIMIR!B279","v":0},{"$f":"IMPRIMIR!C279","v":0},{"$f":"IF(E280=0,0,IMPRIMIR!D279)","v":0},{"$f":"IF(E280=0,0,IMPRIMIR!E279)","v":0},0,0,0]
[null,{"$f":"IF(E281=0,0,IMPRIMIR!A280)","v":0},{"$f":"IF(E281=0,0,IMPRIMIR!$D$3)","v":0},0,{"$f":"IMPRIMIR!B280","v":0},{"$f":"IMPRIMIR!C280","v":0},{"$f":"IF(E281=0,0,IMPRIMIR!D280)","v":0},{"$f":"IF(E281=0,0,IMPRIMIR!E280)","v":0},0,0,0]
[null,{"$f":"IF(E282=0,0,IMPRIMIR!A281)","v":0},{"$f":"IF(E282=0,0,IMPRIMIR!$D$3)","v":0},0,{"$f":"IMPRIMIR!B281","v":0},{"$f":"IMPRIMIR!C281","v":0},{"$f":"IF(E282=0,0,IMPRIMIR!D281)","v":0},{"$f":"IF(E282=0,0,IMPRIMIR!E281)","v":0},0,0,0]
[null,{"$f":"IF(E283=0,0,IMPRIMIR!A282)","v":0},{"$f":"IF(E283=0,0,IMPRIMIR!$D$3)","v":0},0,{"$f":"IMPRIMIR!B282","v":0},{"$f":"IMPRIMIR!C282","v":0},{"$f":"IF(E283=0,0,IMPRIMIR!D282)","v":0},{"$f":"IF(E283=0,0,IMPRIMIR!E282)","v":0},0,0,0]
[null,{"$f":"IF(E284=0,0,IMPRIMIR!A283)","v":0},{"$f":"IF(E284=0,0,IMPRIMIR!$D$3)","v":0},0,{"$f":"IMPRIMIR!B283","v":0},{"$f":"IMPRIMIR!C283","v":0},{"$f":"IF(E284=0,0,IMPRIMIR!D283)","v":0},{"$f":"IF(E284=0,0,IMPRIMIR!E283)","v":0},0,0,0]
[null,{"$f":"IF(E285=0,0,IMPRIMIR!A284)","v":0},{"$f":"IF(E285=0,0,IMPRIMIR!$D$3)","v":0},0,{"$f":"IMPRIMIR!B284","v":0},{"$f":"IMPRIMIR!C284","v":0},{"$f":"IF(E285=0,0,IMPRIMIR!D284)","v":0},{"$f":"IF(E285=0,0,IMPRIMIR!E284)","v":0},0,0,0]
[null,{"$f":"IF(E286=0,0,IMPRIMIR!A285)","v":0},{"$f":"IF(E286=0,0,IMPRIMIR!$D$3)","v":0},0,{"$f":"IMPRIMIR!B285","v":0},{"$f":"IMPRIMIR!C285","v":0},{"$f":"IF(E286=0,0,IMPRIMIR!D285)","v":0},{"$f":"IF(E286=0,0,IMPRIMIR!E285)","v":0},0,0,0]
[null,{"$f":"IF(E287=0,0,IMPRIMIR!A286)","v":0},{"$f":"IF(E287=0,0,IMPRIMIR!$D$3)","v":0},0,{"$f":"IMPRIMIR!B286","v":0},{"$f":"IMPRIMIR!C286","v":0},{"$f":"IF(E287=0,0,IMPRIMIR!D286)","v":0},{"$f":"IF(E287=0,0,IMPRIMIR!E286)","v":0},0,0,0]
[null,{"$f":"IF(E288=0,0,IMPRIMIR!A287)","v":0},{"$f":"IF(E288=0,0,IMPRIMIR!$D$3)","v":0},0,{"$f":"IMPRIMIR!B287","v":0},{"$f":"IMPRIMIR!C287","v":0},{"$f":"IF(E288=0,0,IMPRIMIR!D287)","v":0},{"$f":"IF(E288=0,0,IMPRIMIR!E287)","v":0},0,0,0]
[null,{"$f":"IF(E289=0,0,IMPRIMIR!A288)","v":0},{"$f":"IF(E289=0,0,IMPRIMIR!$D$3)","v":0},0,{"$f":"IMPRIMIR!B288","v":0},{"$f":"IMPRIMIR!C288","v":0},{"$f":"IF(E289=0,0,IMPRIMIR!D288)","v":0},{"$f":"IF(E289=0,0,IMPRIMIR!E288)","v":0},0,0,0]
[null,{"$f":"IF(E290=0,0,IMPRIMIR!A289)","v":0},{"$f":"IF(E290=0,0,IMPRIMIR!$D$3)","v":0},0,{"$f":"IMPRIMIR!B289","v":0},{"$f":"IMPRIMIR!C289","v":0},{"$f":"IF(E290=0,0,IMPRIMIR!D289)","v":0},{"$f":"IF(E290=0,0,IMPRIMIR!E289)","v":0},0,0,0]
[null,{"$f":"IF(E291=0,0,IMPRIMIR!A290)","v":0},{"$f":"IF(E291=0,0,IMPRIMIR!$D$3)","v":0},0,{"$f":"IMPRIMIR!B290","v":0},{"$f":"IMPRIMIR!C290","v":0},{"$f":"IF(E291=0,0,IMPRIMIR!D290)","v":0},{"$f":"IF(E291=0,0,IMPRIMIR!E290)","v":0},0,0,0]
[null,{"$f":"IF(E292=0,0,IMPRIMIR!A291)","v":0},{"$f":"IF(E292=0,0,IMPRIMIR!$D$3)","v":0},0,{"$f":"IMPRIMIR!B291","v":0},{"$f":"IMPRIMIR!C291","v":0},{"$f":"IF(E292=0,0,IMPRIMIR!D291)","v":0},{"$f":"IF(E292=0,0,IMPRIMIR!E291)","v":0},0,0,0]
[null,{"$f":"IF(E293=0,0,IMPRIMIR!A292)","v":0},{"$f":"IF(E293=0,0,IMPRIMIR!$D$3)","v":0},0,{"$f":"IMPRIMIR!B292","v":0},{"$f":"IMPRIMIR!C292","v":0},{"$f":"IF(E293=0,0,IMPRIMIR!D292)","v":0},{"$f":"IF(E293=0,0,IMPRIMIR!E292)","v":0},0,0,0]
[null,{"$f":"IF(E294=0,0,IMPRIMIR!A293)","v":0},{"$f":"IF(E294=0,0,IMPRIMIR!$D$3)","v":0},0,{"$f":"IMPRIMIR!B293","v":0},{"$f":"IMPRIMIR!C293","v":0},{"$f":"IF(E294=0,0,IMPRIMIR!D293)","v":0},{"$f":"IF(E294=0,0,IMPRIMIR!E293)","v":0},0,0,0]
[null,{"$f":"IF(E295=0,0,IMPRIMIR!A294)","v":0},{"$f":"IF(E295=0,0,IMPRIMIR!$D$3)","v":0},0,{"$f":"IMPRIMIR!B294","v":0},{"$f":"IMPRIMIR!C294","v":0},{"$f":"IF(E295=0,0,IMPRIMIR!D294)","v":0},{"$f":"IF(E295=0,0,IMPRIMIR!E294)","v":0},0,0,0]
[null,{"$f":"IF(E296=0,0,IMPRIMIR!A295)","v":0},{"$f":"IF(E296=0,0,IMPRIMIR!$D$3)","v":0},0,{"$f":"IMPRIMIR!B295","v":0},{"$f":"IMPRIMIR!C295","v":0},{"$f":"IF(E296=0,0,IMPRIMIR!D295)","v":0},{"$f":"IF(E296=0,0,IMPRIMIR!E295)","v":0},0,0,0]
[null,{"$f":"IF(E297=0,0,IMPRIMIR!A296)","v":0},{"$f":"IF(E297=0,0,IMPRIMIR!$D$3)","v":0},0,{"$f":"IMPRIMIR!B296","v":0},{"$f":"IMPRIMIR!C296","v":0},{"$f":"IF(E297=0,0,IMPRIMIR!D296)","v":0},{"$f":"IF(E297=0,0,IMPRIMIR!E296)","v":0},0,0,0]
[null,{"$f":"IF(E298=0,0,IMPRIMIR!A297)","v":0},{"$f":"IF(E298=0,0,IMPRIMIR!$D$3)","v":0},0,{"$f":"IMPRIMIR!B297","v":0},{"$f":"IMPRIMIR!C297","v":0},{"$f":"IF(E298=0,0,IMPRIMIR!D297)","v":0},{"$f":"IF(E298=0,0,IMPRIMIR!E297)","v":0},0,0,0]
[null,{"$f":"IF(E299=0,0,IMPRIMIR!A298)","v":0},{"$f":"IF(E299=0,0,IMPRIMIR!$D$3)","v":0},0,{"$f":"IMPRIMIR!B298","v":0},{"$f":"IMPRIMIR!C298","v":0},{"$f":"IF(E299=0,0,IMPRIMIR!D298)","v":0},{"$f":"IF(E299=0,0,IMPRIMIR!E298)","v":0},0,0,0]
[null,{"$f":"IF(E300=0,0,IMPRIMIR!A299)","v":0},{"$f":"IF(E300=0,0,IMPRIMIR!$D$3)","v":0},0,{"$f":"IMPRIMIR!B299","v":0},{"$f":"IMPRIMIR!C299","v":0},{"$f":"IF(E300=0,0,IMPRIMIR!D299)","v":0},{"$f":"IF(E300=0,0,IMPRIMIR!E299)","v":0},0,0,0]
[null,{"$f":"IF(E301=0,0,IMPRIMIR!A300)","v":0},{"$f":"IF(E301=0,0,IMPRIMIR!$D$3)","v":0},0,{"$f":"IMPRIMIR!B300","v":0},{"$f":"IMPRIMIR!C300","v":0},{"$f":"IF(E301=0,0,IMPRIMIR!D300)","v":0},{"$f":"IF(E301=0,0,IMPRIMIR!E300)","v":0},0,0,0]
[null,{"$f":"IF(E302=0,0,IMPRIMIR!A301)","v":0},{"$f":"IF(E302=0,0,IMPRIMIR!$D$3)","v":0},0,{"$f":"IMPRIMIR!B301","v":0},{"$f":"IMPRIMIR!C301","v":0},{"$f":"IF(E302=0,0,IMPRIMIR!D301)","v":0},{"$f":"IF(E302=0,0,IMPRIMIR!E301)","v":0},0,0,0]
[null,{"$f":"IF(E303=0,0,IMPRIMIR!A302)","v":0},{"$f":"IF(E303=0,0,IMPRIMIR!$D$3)","v":0},0,{"$f":"IMPRIMIR!B302","v":0},{"$f":"IMPRIMIR!C302","v":0},{"$f":"IF(E303=0,0,IMPRIMIR!D302)","v":0},{"$f":"IF(E303=0,0,IMPRIMIR!E302)","v":0},0,0,0]
[null,{"$f":"IF(E304=0,0,IMPRIMIR!A303)","v":0},{"$f":"IF(E304=0,0,IMPRIMIR!$D$3)","v":0},0,{"$f":"IMPRIMIR!B303","v":0},{"$f":"IMPRIMIR!C303","v":0},{"$f":"IF(E304=0,0,IMPRIMIR!D303)","v":0},{"$f":"IF(E304=0,0,IMPRIMIR!E303)","v":0},0,0,0]
[null,{"$f":"IF(E305=0,0,IMPRIMIR!A304)","v":0},{"$f":"IF(E305=0,0,IMPRIMIR!$D$3)","v":0},0,{"$f":"IMPRIMIR!B304","v":0},{"$f":"IMPRIMIR!C304","v":0},{"$f":"IF(E305=0,0,IMPRIMIR!D304)","v":0},{"$f":"IF(E305=0,0,IMPRIMIR!E304)","v":0},0,0,0]
[null,{"$f":"IF(E306=0,0,IMPRIMIR!A305)","v":0},{"$f":"IF(E306=0,0,IMPRIMIR!$D$3)","v":0},0,{"$f":"IMPRIMIR!B305","v":0},{"$f":"IMPRIMIR!C305","v":0},{"$f":"IF(E306=0,0,IMPRIMIR!D305)","v":0},{"$f":"IF(E306=0,0,IMPRIMIR!E305)","v":0},0,0,0]
[null,{"$f":"IF(E307=0,0,IMPRIMIR!A306)","v":0},{"$f":"IF(E307=0,0,IMPRIMIR!$D$3)","v":0},0,{"$f":"IMPRIMIR!B306","v":0},{"$f":"IMPRIMIR!C306","v":0},{"$f":"IF(E307=0,0,IMPRIMIR!D306)","v":0},{"$f":"IF(E307=0,0,IMPRIMIR!E306)","v":0},0,0,0]
[null,{"$f":"IF(E308=0,0,IMPRIMIR!A307)","v":0},{"$f":"IF(E308=0,0,IMPRIMIR!$D$3)","v":0},0,{"$f":"IMPRIMIR!B307","v":0},{"$f":"IMPRIMIR!C307","v":0},{"$f":"IF(E308=0,0,IMPRIMIR!D307)","v":0},{"$f":"IF(E308=0,0,IMPRIMIR!E307)","v":0},0,0,0]
[null,{"$f":"IF(E309=0,0,IMPRIMIR!A308)","v":0},{"$f":"IF(E309=0,0,IMPRIMIR!$D$3)","v":0},0,{"$f":"IMPRIMIR!B308","v":0},{"$f":"IMPRIMIR!C308","v":0},{"$f":"IF(E309=0,0,IMPRIMIR!D308)","v":0},{"$f":"IF(E309=0,0,IMPRIMIR!E308)","v":0},0,0,0]
[null,{"$f":"IF(E310=0,0,IMPRIMIR!A309)","v":0},{"$f":"IF(E310=0,0,IMPRIMIR!$D$3)","v":0},0,{"$f":"IMPRIMIR!B309","v":0},{"$f":"IMPRIMIR!C309","v":0},{"$f":"IF(E310=0,0,IMPRIMIR!D309)","v":0},{"$f":"IF(E310=0,0,IMPRIMIR!E309)","v":0},0,0,0]
[null,{"$f":"IF(E311=0,0,IMPRIMIR!A310)","v":0},{"$f":"IF(E311=0,0,IMPRIMIR!$D$3)","v":0},0,{"$f":"IMPRIMIR!B310","v":0},{"$f":"IMPRIMIR!C310","v":0},{"$f":"IF(E311=0,0,IMPRIMIR!D310)","v":0},{"$f":"IF(E311=0,0,IMPRIMIR!E310)","v":0},0,0,0]
[null,{"$f":"IF(E312=0,0,IMPRIMIR!A311)","v":0},{"$f":"IF(E312=0,0,IMPRIMIR!$D$3)","v":0},0,{"$f":"IMPRIMIR!B311","v":0},{"$f":"IMPRIMIR!C311","v":0},{"$f":"IF(E312=0,0,IMPRIMIR!D311)","v":0},{"$f":"IF(E312=0,0,IMPRIMIR!E311)","v":0},0,0,0]
[null,{"$f":"IF(E313=0,0,IMPRIMIR!A312)","v":0},{"$f":"IF(E313=0,0,IMPRIMIR!$D$3)","v":0},0,{"$f":"IMPRIMIR!B312","v":0},{"$f":"IMPRIMIR!C312","v":0},{"$f":"IF(E313=0,0,IMPRIMIR!D312)","v":0},{"$f":"IF(E313=0,0,IMPRIMIR!E312)","v":0},0,0,0]
[null,{"$f":"IF(E314=0,0,IMPRIMIR!A313)","v":0},{"$f":"IF(E314=0,0,IMPRIMIR!$D$3)","v":0},0,{"$f":"IMPRIMIR!B313","v":0},{"$f":"IMPRIMIR!C313","v":0},{"$f":"IF(E314=0,0,IMPRIMIR!D313)","v":0},{"$f":"IF(E314=0,0,IMPRIMIR!E313)","v":0},0,0,0]
[null,{"$f":"IF(E315=0,0,IMPRIMIR!A314)","v":0},{"$f":"IF(E315=0,0,IMPRIMIR!$D$3)","v":0},0,{"$f":"IMPRIMIR!B314","v":0},{"$f":"IMPRIMIR!C314","v":0},{"$f":"IF(E315=0,0,IMPRIMIR!D314)","v":0},{"$f":"IF(E315=0,0,IMPRIMIR!E314)","v":0},0,0,0]
[null,{"$f":"IF(E316=0,0,IMPRIMIR!A315)","v":0},{"$f":"IF(E316=0,0,IMPRIMIR!$D$3)","v":0},0,{"$f":"IMPRIMIR!B315","v":0},{"$f":"IMPRIMIR!C315","v":0},{"$f":"IF(E316=0,0,IMPRIMIR!D315)","v":0},{"$f":"IF(E316=0,0,IMPRIMIR!E315)","v":0},0,0,0]
[null,{"$f":"IF(E317=0,0,IMPRIMIR!A316)","v":0},{"$f":"IF(E317=0,0,IMPRIMIR!$D$3)","v":0},0,{"$f":"IMPRIMIR!B316","v":0},{"$f":"IMPRIMIR!C316","v":0},{"$f":"IF(E317=0,0,IMPRIMIR!D316)","v":0},{"$f":"IF(E317=0,0,IMPRIMIR!E316)","v":0},0,0,0]
[null,{"$f":"IF(E318=0,0,IMPRIMIR!A317)","v":0},{"$f":"IF(E318=0,0,IMPRIMIR!$D$3)","v":0},0,{"$f":"IMPRIMIR!B317","v":0},{"$f":"IMPRIMIR!C317","v":0},{"$f":"IF(E318=0,0,IMPRIMIR!D317)","v":0},{"$f":"IF(E318=0,0,IMPRIMIR!E317)","v":0},0,0,0]
[null,{"$f":"IF(E319=0,0,IMPRIMIR!A318)","v":0},{"$f":"IF(E319=0,0,IMPRIMIR!$D$3)","v":0},0,{"$f":"IMPRIMIR!B318","v":0},{"$f":"IMPRIMIR!C318","v":0},{"$f":"IF(E319=0,0,IMPRIMIR!D318)","v":0},{"$f":"IF(E319=0,0,IMPRIMIR!E318)","v":0},0,0,0]
[null,{"$f":"IF(E320=0,0,IMPRIMIR!A319)","v":0},{"$f":"IF(E320=0,0,IMPRIMIR!$D$3)","v":0},0,{"$f":"IMPRIMIR!B319","v":0},{"$f":"IMPRIMIR!C319","v":0},{"$f":"IF(E320=0,0,IMPRIMIR!D319)","v":0},{"$f":"IF(E320=0,0,IMPRIMIR!E319)","v":0},0,0,0]
[null,{"$f":"IF(E321=0,0,IMPRIMIR!A320)","v":0},{"$f":"IF(E321=0,0,IMPRIMIR!$D$3)","v":0},0,{"$f":"IMPRIMIR!B320","v":0},{"$f":"IMPRIMIR!C320","v":0},{"$f":"IF(E321=0,0,IMPRIMIR!D320)","v":0},{"$f":"IF(E321=0,0,IMPRIMIR!E320)","v":0},0,0,0]
[null,{"$f":"IF(E322=0,0,IMPRIMIR!A321)","v":0},{"$f":"IF(E322=0,0,IMPRIMIR!$D$3)","v":0},0,{"$f":"IMPRIMIR!B321","v":0},{"$f":"IMPRIMIR!C321","v":0},{"$f":"IF(E322=0,0,IMPRIMIR!D321)","v":0},{"$f":"IF(E322=0,0,IMPRIMIR!E321)","v":0},0,0,0]
[null,{"$f":"IF(E323=0,0,IMPRIMIR!A322)","v":0},{"$f":"IF(E323=0,0,IMPRIMIR!$D$3)","v":0},0,{"$f":"IMPRIMIR!B322","v":0},{"$f":"IMPRIMIR!C322","v":0},{"$f":"IF(E323=0,0,IMPRIMIR!D322)","v":0},{"$f":"IF(E323=0,0,IMPRIMIR!E322)","v":0},0,0,0]
[null,{"$f":"IF(E324=0,0,IMPRIMIR!A323)","v":0},{"$f":"IF(E324=0,0,IMPRIMIR!$D$3)","v":0},0,{"$f":"IMPRIMIR!B323","v":0},{"$f":"IMPRIMIR!C323","v":0},{"$f":"IF(E324=0,0,IMPRIMIR!D323)","v":0},{"$f":"IF(E324=0,0,IMPRIMIR!E323)","v":0},0,0,0]
[null,{"$f":"IF(E325=0,0,IMPRIMIR!A324)","v":0},{"$f":"IF(E325=0,0,IMPRIMIR!$D$3)","v":0},0,{"$f":"IMPRIMIR!B324","v":0},{"$f":"IMPRIMIR!C324","v":0},{"$f":"IF(E325=0,0,IMPRIMIR!D324)","v":0},{"$f":"IF(E325=0,0,IMPRIMIR!E324)","v":0},0,0,0]
[null,{"$f":"IF(E326=0,0,IMPRIMIR!A325)","v":0},{"$f":"IF(E326=0,0,IMPRIMIR!$D$3)","v":0},0,{"$f":"IMPRIMIR!B325","v":0},{"$f":"IMPRIMIR!C325","v":0},{"$f":"IF(E326=0,0,IMPRIMIR!D325)","v":0},{"$f":"IF(E326=0,0,IMPRIMIR!E325)","v":0},0,0,0]
[null,{"$f":"IF(E327=0,0,IMPRIMIR!A326)","v":0},{"$f":"IF(E327=0,0,IMPRIMIR!$D$3)","v":0},0,{"$f":"IMPRIMIR!B326","v":0},{"$f":"IMPRIMIR!C326","v":0},{"$f":"IF(E327=0,0,IMPRIMIR!D326)","v":0},{"$f":"IF(E327=0,0,IMPRIMIR!E326)","v":0},0,0,0]
[null,{"$f":"IF(E328=0,0,IMPRIMIR!A327)","v":0},{"$f":"IF(E328=0,0,IMPRIMIR!$D$3)","v":0},0,{"$f":"IMPRIMIR!B327","v":0},{"$f":"IMPRIMIR!C327","v":0},{"$f":"IF(E328=0,0,IMPRIMIR!D327)","v":0},{"$f":"IF(E328=0,0,IMPRIMIR!E327)","v":0},0,0,0]
[null,{"$f":"IF(E329=0,0,IMPRIMIR!A328)","v":0},{"$f":"IF(E329=0,0,IMPRIMIR!$D$3)","v":0},{"$f":"IF(E329=\"0\",0,$G$2)","v":0},{"$f":"IMPRIMIR!B328","v":0},{"$f":"IMPRIMIR!C328","v":0},{"$f":"IF(E329=0,0,IMPRIMIR!D328)","v":0},{"$f":"IF(E329=0,0,IMPRIMIR!E328)","v":0},{"$f":"IF(E329=0,0,$G$2)","v":0},{"$f":"IF(E329=0,0,$G$4)","v":0},{"$f":"IF(E329=0,0,$G$3)","v":0}]
[null,{"$f":"IF(E330=0,0,IMPRIMIR!A329)","v":0},{"$f":"IF(E330=0,0,IMPRIMIR!$D$3)","v":0},0,{"$f":"IMPRIMIR!B329","v":0},{"$f":"IMPRIMIR!C329","v":0},{"$f":"IF(E330=0,0,IMPRIMIR!D329)","v":0},{"$f":"IF(E330=0,0,IMPRIMIR!E329)","v":0},0,0,0]
[null,{"$f":"IF(E331=0,0,IMPRIMIR!A330)","v":0},{"$f":"IF(E331=0,0,IMPRIMIR!$D$3)","v":0},0,{"$f":"IMPRIMIR!B330","v":0},{"$f":"IMPRIMIR!C330","v":0},{"$f":"IF(E331=0,0,IMPRIMIR!D330)","v":0},{"$f":"IF(E331=0,0,IMPRIMIR!E330)","v":0},0,0,0]
[null,{"$f":"IF(E332=0,0,IMPRIMIR!A331)","v":0},{"$f":"IF(E332=0,0,IMPRIMIR!$D$3)","v":0},0,{"$f":"IMPRIMIR!B331","v":0},{"$f":"IMPRIMIR!C331","v":0},{"$f":"IF(E332=0,0,IMPRIMIR!D331)","v":0},{"$f":"IF(E332=0,0,IMPRIMIR!E331)","v":0},0,0,0]
[null,{"$f":"IF(E333=0,0,IMPRIMIR!A332)","v":0},{"$f":"IF(E333=0,0,IMPRIMIR!$D$3)","v":0},0,{"$f":"IMPRIMIR!B332","v":0},{"$f":"IMPRIMIR!C332","v":0},{"$f":"IF(E333=0,0,IMPRIMIR!D332)","v":0},{"$f":"IF(E333=0,0,IMPRIMIR!E332)","v":0},0,0,0]
[null,{"$f":"IF(E334=0,0,IMPRIMIR!A333)","v":0},{"$f":"IF(E334=0,0,IMPRIMIR!$D$3)","v":0},0,{"$f":"IMPRIMIR!B333","v":0},{"$f":"IMPRIMIR!C333","v":0},{"$f":"IF(E334=0,0,IMPRIMIR!D333)","v":0},{"$f":"IF(E334=0,0,IMPRIMIR!E333)","v":0},0,0,0]
[null,{"$f":"IF(E335=0,0,IMPRIMIR!A334)","v":0},{"$f":"IF(E335=0,0,IMPRIMIR!$D$3)","v":0},0,{"$f":"IMPRIMIR!B334","v":0},{"$f":"IMPRIMIR!C334","v":0},{"$f":"IF(E335=0,0,IMPRIMIR!D334)","v":0},{"$f":"IF(E335=0,0,IMPRIMIR!E334)","v":0},0,0,0]
[null,{"$f":"IF(E336=0,0,IMPRIMIR!A335)","v":0},{"$f":"IF(E336=0,0,IMPRIMIR!$D$3)","v":0},0,{"$f":"IMPRIMIR!B335","v":0},{"$f":"IMPRIMIR!C335","v":0},{"$f":"IF(E336=0,0,IMPRIMIR!D335)","v":0},{"$f":"IF(E336=0,0,IMPRIMIR!E335)","v":0},0,0,0]
[null,{"$f":"IF(E337=0,0,IMPRIMIR!A336)","v":0},{"$f":"IF(E337=0,0,IMPRIMIR!$D$3)","v":0},0,{"$f":"IMPRIMIR!B336","v":0},{"$f":"IMPRIMIR!C336","v":0},{"$f":"IF(E337=0,0,IMPRIMIR!D336)","v":0},{"$f":"IF(E337=0,0,IMPRIMIR!E336)","v":0},0,0,0]
[null,{"$f":"IF(E338=0,0,IMPRIMIR!A337)","v":0},{"$f":"IF(E338=0,0,IMPRIMIR!$D$3)","v":0},0,{"$f":"IMPRIMIR!B337","v":0},{"$f":"IMPRIMIR!C337","v":0},{"$f":"IF(E338=0,0,IMPRIMIR!D337)","v":0},{"$f":"IF(E338=0,0,IMPRIMIR!E337)","v":0},0,0,0]
[null,{"$f":"IF(E339=0,0,IMPRIMIR!A338)","v":0},{"$f":"IF(E339=0,0,IMPRIMIR!$D$3)","v":0},0,{"$f":"IMPRIMIR!B338","v":0},{"$f":"IMPRIMIR!C338","v":0},{"$f":"IF(E339=0,0,IMPRIMIR!D338)","v":0},{"$f":"IF(E339=0,0,IMPRIMIR!E338)","v":0},0,0,0]
[null,{"$f":"IF(E340=0,0,IMPRIMIR!A339)","v":0},{"$f":"IF(E340=0,0,IMPRIMIR!$D$3)","v":0},0,{"$f":"IMPRIMIR!B339","v":0},{"$f":"IMPRIMIR!C339","v":0},{"$f":"IF(E340=0,0,IMPRIMIR!D339)","v":0},{"$f":"IF(E340=0,0,IMPRIMIR!E339)","v":0},0,0,0]
[null,{"$f":"IF(E341=0,0,IMPRIMIR!A340)","v":0},{"$f":"IF(E341=0,0,IMPRIMIR!$D$3)","v":0},0,{"$f":"IMPRIMIR!B340","v":0},{"$f":"IMPRIMIR!C340","v":0},{"$f":"IF(E341=0,0,IMPRIMIR!D340)","v":0},{"$f":"IF(E341=0,0,IMPRIMIR!E340)","v":0},0,0,0]
[null,{"$f":"IF(E342=0,0,IMPRIMIR!A341)","v":0},{"$f":"IF(E342=0,0,IMPRIMIR!$D$3)","v":0},0,{"$f":"IMPRIMIR!B341","v":0},{"$f":"IMPRIMIR!C341","v":0},{"$f":"IF(E342=0,0,IMPRIMIR!D341)","v":0},{"$f":"IF(E342=0,0,IMPRIMIR!E341)","v":0},0,0,0]
[null,{"$f":"IF(E343=0,0,IMPRIMIR!A342)","v":0},{"$f":"IF(E343=0,0,IMPRIMIR!$D$3)","v":0},0,{"$f":"IMPRIMIR!B342","v":0},{"$f":"IMPRIMIR!C342","v":0},{"$f":"IF(E343=0,0,IMPRIMIR!D342)","v":0},{"$f":"IF(E343=0,0,IMPRIMIR!E342)","v":0},0,0,0]
[null,{"$f":"IF(E344=0,0,IMPRIMIR!A343)","v":0},{"$f":"IF(E344=0,0,IMPRIMIR!$D$3)","v":0},0,{"$f":"IMPRIMIR!B343","v":0},{"$f":"IMPRIMIR!C343","v":0},{"$f":"IF(E344=0,0,IMPRIMIR!D343)","v":0},{"$f":"IF(E344=0,0,IMPRIMIR!E343)","v":0},0,0,0]
[null,{"$f":"IF(E345=0,0,IMPRIMIR!A344)","v":0},{"$f":"IF(E345=0,0,IMPRIMIR!$D$3)","v":0},0,{"$f":"IMPRIMIR!B344","v":0},{"$f":"IMPRIMIR!C344","v":0},{"$f":"IF(E345=0,0,IMPRIMIR!D344)","v":0},{"$f":"IF(E345=0,0,IMPRIMIR!E344)","v":0},0,0,0]
[null,{"$f":"IF(E346=0,0,IMPRIMIR!A345)","v":0},{"$f":"IF(E346=0,0,IMPRIMIR!$D$3)","v":0},0,{"$f":"IMPRIMIR!B345","v":0},{"$f":"IMPRIMIR!C345","v":0},{"$f":"IF(E346=0,0,IMPRIMIR!D345)","v":0},{"$f":"IF(E346=0,0,IMPRIMIR!E345)","v":0},0,0,0]
[null,{"$f":"IF(E347=0,0,IMPRIMIR!A346)","v":0},{"$f":"IF(E347=0,0,IMPRIMIR!$D$3)","v":0},0,{"$f":"IMPRIMIR!B346","v":0},{"$f":"IMPRIMIR!C346","v":0},{"$f":"IF(E347=0,0,IMPRIMIR!D346)","v":0},{"$f":"IF(E347=0,0,IMPRIMIR!E346)","v":0},0,0,0]
[null,{"$f":"IF(E348=0,0,IMPRIMIR!A347)","v":0},{"$f":"IF(E348=0,0,IMPRIMIR!$D$3)","v":0},0,{"$f":"IMPRIMIR!B347","v":0},{"$f":"IMPRIMIR!C347","v":0},{"$f":"IF(E348=0,0,IMPRIMIR!D347)","v":0},{"$f":"IF(E348=0,0,IMPRIMIR!E347)","v":0},0,0,0]
[null,{"$f":"IF(E349=0,0,IMPRIMIR!A348)","v":0},{"$f":"IF(E349=0,0,IMPRIMIR!$D$3)","v":0},0,{"$f":"IMPRIMIR!B348","v":0},{"$f":"IMPRIMIR!C348","v":0},{"$f":"IF(E349=0,0,IMPRIMIR!D348)","v":0},{"$f":"IF(E349=0,0,IMPRIMIR!E348)","v":0},0,0,0]
[null,{"$f":"IF(E350=0,0,IMPRIMIR!A349)","v":"d CANT. ACC. TOT."},{"$f":"IF(E350=0,0,IMPRIMIR!$D$3)","v":0},0,{"$f":"IMPRIMIR!B349","v":"0"},{"$f":"IMPRIMIR!C349","v":"0"},{"$f":"IF(E350=0,0,IMPRIMIR!D349)","v":"TOTAL ACCIONES:"},{"$f":"IF(E350=0,0,IMPRIMIR!E349)","v":"INCOMPLETO RECHAZAR"},0,0,0]
[null,{"$f":"IF(E351=0,0,IMPRIMIR!A350)","v":0},{"$f":"IF(E351=0,0,IMPRIMIR!$D$3)","v":0},0,{"$f":"IMPRIMIR!B350","v":0},{"$f":"IMPRIMIR!C350","v":0},{"$f":"IF(E351=0,0,IMPRIMIR!D350)","v":0},{"$f":"IF(E351=0,0,IMPRIMIR!E350)","v":0},0,0,0]
[null,{"$f":"IF(E352=0,0,IMPRIMIR!A351)","v":0},{"$f":"IF(E352=0,0,IMPRIMIR!$D$3)","v":0},0,{"$f":"IMPRIMIR!B351","v":0},{"$f":"IMPRIMIR!C351","v":0},{"$f":"IF(E352=0,0,IMPRIMIR!D351)","v":0},{"$f":"IF(E352=0,0,IMPRIMIR!E351)","v":0},0,0,0]
[null,{"$f":"IF(E353=0,0,IMPRIMIR!A352)","v":0},{"$f":"IF(E353=0,0,IMPRIMIR!$D$3)","v":0},0,{"$f":"IMPRIMIR!B352","v":0},{"$f":"IMPRIMIR!C352","v":0},{"$f":"IF(E353=0,0,IMPRIMIR!D352)","v":0},{"$f":"IF(E353=0,0,IMPRIMIR!E352)","v":0},0,0,0]
[null,{"$f":"IF(E354=0,0,IMPRIMIR!A353)","v":0},{"$f":"IF(E354=0,0,IMPRIMIR!$D$3)","v":0},0,{"$f":"IMPRIMIR!B353","v":0},{"$f":"IMPRIMIR!C353","v":0},{"$f":"IF(E354=0,0,IMPRIMIR!D353)","v":0},{"$f":"IF(E354=0,0,IMPRIMIR!E353)","v":0},0,0,0]
[null,{"$f":"IF(E355=0,0,IMPRIMIR!A354)","v":0},{"$f":"IF(E355=0,0,IMPRIMIR!$D$3)","v":0},0,{"$f":"IMPRIMIR!B354","v":0},{"$f":"IMPRIMIR!C354","v":0},{"$f":"IF(E355=0,0,IMPRIMIR!D354)","v":0},{"$f":"IF(E355=0,0,IMPRIMIR!E354)","v":0},0,0,0]
[null,{"$f":"IF(E356=0,0,IMPRIMIR!A355)","v":0},{"$f":"IF(E356=0,0,IMPRIMIR!$D$3)","v":0},0,{"$f":"IMPRIMIR!B355","v":0},{"$f":"IMPRIMIR!C355","v":0},{"$f":"IF(E356=0,0,IMPRIMIR!D355)","v":0},{"$f":"IF(E356=0,0,IMPRIMIR!E355)","v":0},0,0,0]
[null,{"$f":"IF(E357=0,0,IMPRIMIR!A356)","v":0},{"$f":"IF(E357=0,0,IMPRIMIR!$D$3)","v":0},0,{"$f":"IMPRIMIR!B356","v":0},{"$f":"IMPRIMIR!C356","v":0},{"$f":"IF(E357=0,0,IMPRIMIR!D356)","v":0},{"$f":"IF(E357=0,0,IMPRIMIR!E356)","v":0},0,0,0]
[null,{"$f":"IF(E358=0,0,IMPRIMIR!A357)","v":0},{"$f":"IF(E358=0,0,IMPRIMIR!$D$3)","v":0},0,{"$f":"IMPRIMIR!B357","v":0},{"$f":"IMPRIMIR!C357","v":0},{"$f":"IF(E358=0,0,IMPRIMIR!D357)","v":0},{"$f":"IF(E358=0,0,IMPRIMIR!E357)","v":0},0,0,0]
[null,{"$f":"IF(E359=0,0,IMPRIMIR!A358)","v":0},{"$f":"IF(E359=0,0,IMPRIMIR!$D$3)","v":0},0,{"$f":"IMPRIMIR!B358","v":0},{"$f":"IMPRIMIR!C358","v":0},{"$f":"IF(E359=0,0,IMPRIMIR!D358)","v":0},{"$f":"IF(E359=0,0,IMPRIMIR!E358)","v":0},0,0,0]
[null,{"$f":"IF(E360=0,0,IMPRIMIR!A359)","v":0},{"$f":"IF(E360=0,0,IMPRIMIR!$D$3)","v":0},0,{"$f":"IMPRIMIR!B359","v":0},{"$f":"IMPRIMIR!C359","v":0},{"$f":"IF(E360=0,0,IMPRIMIR!D359)","v":0},{"$f":"IF(E360=0,0,IMPRIMIR!E359)","v":0},0,0,0]
[null,{"$f":"IF(E361=0,0,IMPRIMIR!A360)","v":0},{"$f":"IF(E361=0,0,IMPRIMIR!$D$3)","v":0},0,{"$f":"IMPRIMIR!B360","v":0},{"$f":"IMPRIMIR!C360","v":0},{"$f":"IF(E361=0,0,IMPRIMIR!D360)","v":0},{"$f":"IF(E361=0,0,IMPRIMIR!E360)","v":0},0,0,0]
[null,{"$f":"IF(E362=0,0,IMPRIMIR!A361)","v":0},{"$f":"IF(E362=0,0,IMPRIMIR!$D$3)","v":0},0,{"$f":"IMPRIMIR!B361","v":0},{"$f":"IMPRIMIR!C361","v":0},{"$f":"IF(E362=0,0,IMPRIMIR!D361)","v":0},{"$f":"IF(E362=0,0,IMPRIMIR!E361)","v":0},0,0,0]
[null,{"$f":"IF(E363=0,0,IMPRIMIR!A362)","v":0},{"$f":"IF(E363=0,0,IMPRIMIR!$D$3)","v":0},0,{"$f":"IMPRIMIR!B362","v":0},{"$f":"IMPRIMIR!C362","v":0},{"$f":"IF(E363=0,0,IMPRIMIR!D362)","v":0},{"$f":"IF(E363=0,0,IMPRIMIR!E362)","v":0},0,0,0]
[null,{"$f":"IF(E364=0,0,IMPRIMIR!A363)","v":0},{"$f":"IF(E364=0,0,IMPRIMIR!$D$3)","v":0},0,{"$f":"IMPRIMIR!B363","v":0},{"$f":"IMPRIMIR!C363","v":0},{"$f":"IF(E364=0,0,IMPRIMIR!D363)","v":0},{"$f":"IF(E364=0,0,IMPRIMIR!E363)","v":0},0,0,0]
[null,{"$f":"IF(E365=0,0,IMPRIMIR!A364)","v":0},{"$f":"IF(E365=0,0,IMPRIMIR!$D$3)","v":0},0,{"$f":"IMPRIMIR!B364","v":0},{"$f":"IMPRIMIR!C364","v":0},{"$f":"IF(E365=0,0,IMPRIMIR!D364)","v":0},{"$f":"IF(E365=0,0,IMPRIMIR!E364)","v":0},0,0,0]
[null,{"$f":"IF(E366=0,0,IMPRIMIR!A365)","v":0},{"$f":"IF(E366=0,0,IMPRIMIR!$D$3)","v":0},0,{"$f":"IMPRIMIR!B365","v":0},{"$f":"IMPRIMIR!C365","v":0},{"$f":"IF(E366=0,0,IMPRIMIR!D365)","v":0},{"$f":"IF(E366=0,0,IMPRIMIR!E365)","v":0},0,0,0]
[null,{"$f":"IF(E367=0,0,IMPRIMIR!A366)","v":0},{"$f":"IF(E367=0,0,IMPRIMIR!$D$3)","v":0},0,{"$f":"IMPRIMIR!B366","v":0},{"$f":"IMPRIMIR!C366","v":0},{"$f":"IF(E367=0,0,IMPRIMIR!D366)","v":0},{"$f":"IF(E367=0,0,IMPRIMIR!E366)","v":0},0,0,0]
[null,{"$f":"IF(E368=0,0,IMPRIMIR!A367)","v":0},{"$f":"IF(E368=0,0,IMPRIMIR!$D$3)","v":0},0,{"$f":"IMPRIMIR!B367","v":0},{"$f":"IMPRIMIR!C367","v":0},{"$f":"IF(E368=0,0,IMPRIMIR!D367)","v":0},{"$f":"IF(E368=0,0,IMPRIMIR!E367)","v":0},0,0,0]
[null,{"$f":"IF(E369=0,0,IMPRIMIR!A368)","v":0},{"$f":"IF(E369=0,0,IMPRIMIR!$D$3)","v":0},0,{"$f":"IMPRIMIR!B368","v":0},{"$f":"IMPRIMIR!C368","v":0},{"$f":"IF(E369=0,0,IMPRIMIR!D368)","v":0},{"$f":"IF(E369=0,0,IMPRIMIR!E368)","v":0},0,0,0]
[null,{"$f":"IF(E370=0,0,IMPRIMIR!A369)","v":0},{"$f":"IF(E370=0,0,IMPRIMIR!$D$3)","v":0},0,{"$f":"IMPRIMIR!B369","v":0},{"$f":"IMPRIMIR!C369","v":0},{"$f":"IF(E370=0,0,IMPRIMIR!D369)","v":0},{"$f":"IF(E370=0,0,IMPRIMIR!E369)","v":0},0,0,0]
[null,{"$f":"IF(E371=0,0,IMPRIMIR!A370)","v":0},{"$f":"IF(E371=0,0,IMPRIMIR!$D$3)","v":0},0,{"$f":"IMPRIMIR!B370","v":0},{"$f":"IMPRIMIR!C370","v":0},{"$f":"IF(E371=0,0,IMPRIMIR!D370)","v":0},{"$f":"IF(E371=0,0,IMPRIMIR!E370)","v":0},0,0,0]
[null,{"$f":"IF(E372=0,0,IMPRIMIR!A371)","v":0},{"$f":"IF(E372=0,0,IMPRIMIR!$D$3)","v":0},0,{"$f":"IMPRIMIR!B371","v":0},{"$f":"IMPRIMIR!C371","v":0},{"$f":"IF(E372=0,0,IMPRIMIR!D371)","v":0},{"$f":"IF(E372=0,0,IMPRIMIR!E371)","v":0},0,0,0]
[null,{"$f":"IF(E373=0,0,IMPRIMIR!A372)","v":0},{"$f":"IF(E373=0,0,IMPRIMIR!$D$3)","v":0},0,{"$f":"IMPRIMIR!B372","v":0},{"$f":"IMPRIMIR!C372","v":0},{"$f":"IF(E373=0,0,IMPRIMIR!D372)","v":0},{"$f":"IF(E373=0,0,IMPRIMIR!E372)","v":0},0,0,0]
[null,{"$f":"IF(E374=0,0,IMPRIMIR!A373)","v":0},{"$f":"IF(E374=0,0,IMPRIMIR!$D$3)","v":0},0,{"$f":"IMPRIMIR!B373","v":0},{"$f":"IMPRIMIR!C373","v":0},{"$f":"IF(E374=0,0,IMPRIMIR!D373)","v":0},{"$f":"IF(E374=0,0,IMPRIMIR!E373)","v":0},0,0,0]
[null,{"$f":"IF(E375=0,0,IMPRIMIR!A374)","v":"e CAP. SUSCR. TOT"},{"$f":"IF(E375=0,0,IMPRIMIR!$D$3)","v":0},0,{"$f":"IMPRIMIR!B374","v":"0"},{"$f":"IMPRIMIR!C374","v":"0"},{"$f":"IF(E375=0,0,IMPRIMIR!D374)","v":"CAPITAL SOCIAL(SUSCRIPTO):"},{"$f":"IF(E375=0,0,IMPRIMIR!E374)","v":"INCOMPLETO RECHAZAR"},0,0,0]
[null,{"$f":"IF(E376=0,0,IMPRIMIR!A375)","v":0},{"$f":"IF(E376=0,0,IMPRIMIR!$D$3)","v":0},0,{"$f":"IMPRIMIR!B375","v":0},{"$f":"IMPRIMIR!C375","v":0},{"$f":"IF(E376=0,0,IMPRIMIR!D375)","v":0},{"$f":"IF(E376=0,0,IMPRIMIR!E375)","v":0},0,0,0]
[null,{"$f":"IF(E377=0,0,IMPRIMIR!A376)","v":0},{"$f":"IF(E377=0,0,IMPRIMIR!$D$3)","v":0},0,{"$f":"IMPRIMIR!B376","v":0},{"$f":"IMPRIMIR!C376","v":0},{"$f":"IF(E377=0,0,IMPRIMIR!D376)","v":0},{"$f":"IF(E377=0,0,IMPRIMIR!E376)","v":0},0,0,0]
[null,{"$f":"IF(E378=0,0,IMPRIMIR!A377)","v":0},{"$f":"IF(E378=0,0,IMPRIMIR!$D$3)","v":0},0,{"$f":"IMPRIMIR!B377","v":0},{"$f":"IMPRIMIR!C377","v":0},{"$f":"IF(E378=0,0,IMPRIMIR!D377)","v":0},{"$f":"IF(E378=0,0,IMPRIMIR!E377)","v":0},0,0,0]
[null,{"$f":"IF(E379=0,0,IMPRIMIR!A378)","v":0},{"$f":"IF(E379=0,0,IMPRIMIR!$D$3)","v":0},0,{"$f":"IMPRIMIR!B378","v":0},{"$f":"IMPRIMIR!C378","v":0},{"$f":"IF(E379=0,0,IMPRIMIR!D378)","v":0},{"$f":"IF(E379=0,0,IMPRIMIR!E378)","v":0},0,0,0]
[null,{"$f":"IF(E380=0,0,IMPRIMIR!A379)","v":0},{"$f":"IF(E380=0,0,IMPRIMIR!$D$3)","v":0},0,{"$f":"IMPRIMIR!B379","v":0},{"$f":"IMPRIMIR!C379","v":0},{"$f":"IF(E380=0,0,IMPRIMIR!D379)","v":0},{"$f":"IF(E380=0,0,IMPRIMIR!E379)","v":0},0,0,0]
[null,{"$f":"IF(E381=0,0,IMPRIMIR!A380)","v":0},{"$f":"IF(E381=0,0,IMPRIMIR!$D$3)","v":0},0,{"$f":"IMPRIMIR!B380","v":0},{"$f":"IMPRIMIR!C380","v":0},{"$f":"IF(E381=0,0,IMPRIMIR!D380)","v":0},{"$f":"IF(E381=0,0,IMPRIMIR!E380)","v":0},0,0,0]
[null,{"$f":"IF(E382=0,0,IMPRIMIR!A381)","v":0},{"$f":"IF(E382=0,0,IMPRIMIR!$D$3)","v":0},0,{"$f":"IMPRIMIR!B381","v":0},{"$f":"IMPRIMIR!C381","v":0},{"$f":"IF(E382=0,0,IMPRIMIR!D381)","v":0},{"$f":"IF(E382=0,0,IMPRIMIR!E381)","v":0},0,0,0]
[null,{"$f":"IF(E383=0,0,IMPRIMIR!A382)","v":0},{"$f":"IF(E383=0,0,IMPRIMIR!$D$3)","v":0},0,{"$f":"IMPRIMIR!B382","v":0},{"$f":"IMPRIMIR!C382","v":0},{"$f":"IF(E383=0,0,IMPRIMIR!D382)","v":0},{"$f":"IF(E383=0,0,IMPRIMIR!E382)","v":0},0,0,0]
[null,{"$f":"IF(E384=0,0,IMPRIMIR!A383)","v":0},{"$f":"IF(E384=0,0,IMPRIMIR!$D$3)","v":0},0,{"$f":"IMPRIMIR!B383","v":0},{"$f":"IMPRIMIR!C383","v":0},{"$f":"IF(E384=0,0,IMPRIMIR!D383)","v":0},{"$f":"IF(E384=0,0,IMPRIMIR!E383)","v":0},0,0,0]
[null,{"$f":"IF(E385=0,0,IMPRIMIR!A384)","v":0},{"$f":"IF(E385=0,0,IMPRIMIR!$D$3)","v":0},0,{"$f":"IMPRIMIR!B384","v":0},{"$f":"IMPRIMIR!C384","v":0},{"$f":"IF(E385=0,0,IMPRIMIR!D384)","v":0},{"$f":"IF(E385=0,0,IMPRIMIR!E384)","v":0},0,0,0]
[null,{"$f":"IF(E386=0,0,IMPRIMIR!A385)","v":0},{"$f":"IF(E386=0,0,IMPRIMIR!$D$3)","v":0},0,{"$f":"IMPRIMIR!B385","v":0},{"$f":"IMPRIMIR!C385","v":0},{"$f":"IF(E386=0,0,IMPRIMIR!D385)","v":0},{"$f":"IF(E386=0,0,IMPRIMIR!E385)","v":0},0,0,0]
[null,{"$f":"IF(E387=0,0,IMPRIMIR!A386)","v":0},{"$f":"IF(E387=0,0,IMPRIMIR!$D$3)","v":0},0,{"$f":"IMPRIMIR!B386","v":0},{"$f":"IMPRIMIR!C386","v":0},{"$f":"IF(E387=0,0,IMPRIMIR!D386)","v":0},{"$f":"IF(E387=0,0,IMPRIMIR!E386)","v":0},0,0,0]
[null,{"$f":"IF(E388=0,0,IMPRIMIR!A387)","v":0},{"$f":"IF(E388=0,0,IMPRIMIR!$D$3)","v":0},0,{"$f":"IMPRIMIR!B387","v":0},{"$f":"IMPRIMIR!C387","v":0},{"$f":"IF(E388=0,0,IMPRIMIR!D387)","v":0},{"$f":"IF(E388=0,0,IMPRIMIR!E387)","v":0},0,0,0]
[null,{"$f":"IF(E389=0,0,IMPRIMIR!A388)","v":0},{"$f":"IF(E389=0,0,IMPRIMIR!$D$3)","v":0},0,{"$f":"IMPRIMIR!B388","v":0},{"$f":"IMPRIMIR!C388","v":0},{"$f":"IF(E389=0,0,IMPRIMIR!D388)","v":0},{"$f":"IF(E389=0,0,IMPRIMIR!E388)","v":0},0,0,0]
[null,{"$f":"IF(E390=0,0,IMPRIMIR!A389)","v":0},{"$f":"IF(E390=0,0,IMPRIMIR!$D$3)","v":0},0,{"$f":"IMPRIMIR!B389","v":0},{"$f":"IMPRIMIR!C389","v":0},{"$f":"IF(E390=0,0,IMPRIMIR!D389)","v":0},{"$f":"IF(E390=0,0,IMPRIMIR!E389)","v":0},0,0,0]
[null,{"$f":"IF(E391=0,0,IMPRIMIR!A390)","v":0},{"$f":"IF(E391=0,0,IMPRIMIR!$D$3)","v":0},0,{"$f":"IMPRIMIR!B390","v":0},{"$f":"IMPRIMIR!C390","v":0},{"$f":"IF(E391=0,0,IMPRIMIR!D390)","v":0},{"$f":"IF(E391=0,0,IMPRIMIR!E390)","v":0},0,0,0]
[null,{"$f":"IF(E392=0,0,IMPRIMIR!A391)","v":0},{"$f":"IF(E392=0,0,IMPRIMIR!$D$3)","v":0},0,{"$f":"IMPRIMIR!B391","v":0},{"$f":"IMPRIMIR!C391","v":0},{"$f":"IF(E392=0,0,IMPRIMIR!D391)","v":0},{"$f":"IF(E392=0,0,IMPRIMIR!E391)","v":0},0,0,0]
[null,{"$f":"IF(E393=0,0,IMPRIMIR!A392)","v":0},{"$f":"IF(E393=0,0,IMPRIMIR!$D$3)","v":0},{"$f":"IF(E393=\"0\",0,$G$2)","v":0},{"$f":"IMPRIMIR!B392","v":0},{"$f":"IMPRIMIR!C392","v":0},{"$f":"IF(E393=0,0,IMPRIMIR!D392)","v":0},{"$f":"IF(E393=0,0,IMPRIMIR!E392)","v":0},{"$f":"IF(E393=0,0,$G$2)","v":0},{"$f":"IF(E393=0,0,$G$4)","v":0},{"$f":"IF(E393=0,0,$G$3)","v":0}]
[null,{"$f":"IF(E394=0,0,IMPRIMIR!A393)","v":0},{"$f":"IF(E394=0,0,IMPRIMIR!$D$3)","v":0},0,{"$f":"IMPRIMIR!B393","v":0},{"$f":"IMPRIMIR!C393","v":0},{"$f":"IF(E394=0,0,IMPRIMIR!D393)","v":0},{"$f":"IF(E394=0,0,IMPRIMIR!E393)","v":0},0,0,0]
[null,{"$f":"IF(E395=0,0,IMPRIMIR!A394)","v":0},{"$f":"IF(E395=0,0,IMPRIMIR!$D$3)","v":0},0,{"$f":"IMPRIMIR!B394","v":0},{"$f":"IMPRIMIR!C394","v":0},{"$f":"IF(E395=0,0,IMPRIMIR!D394)","v":0},{"$f":"IF(E395=0,0,IMPRIMIR!E394)","v":0},0,0,0]
[null,{"$f":"IF(E396=0,0,IMPRIMIR!A395)","v":0},{"$f":"IF(E396=0,0,IMPRIMIR!$D$3)","v":0},0,{"$f":"IMPRIMIR!B395","v":0},{"$f":"IMPRIMIR!C395","v":0},{"$f":"IF(E396=0,0,IMPRIMIR!D395)","v":0},{"$f":"IF(E396=0,0,IMPRIMIR!E395)","v":0},0,0,0]
[null,{"$f":"IF(E397=0,0,IMPRIMIR!A396)","v":0},{"$f":"IF(E397=0,0,IMPRIMIR!$D$3)","v":0},0,{"$f":"IMPRIMIR!B396","v":0},{"$f":"IMPRIMIR!C396","v":0},{"$f":"IF(E397=0,0,IMPRIMIR!D396)","v":0},{"$f":"IF(E397=0,0,IMPRIMIR!E396)","v":0},0,0,0]
[null,{"$f":"IF(E398=0,0,IMPRIMIR!A397)","v":0},{"$f":"IF(E398=0,0,IMPRIMIR!$D$3)","v":0},0,{"$f":"IMPRIMIR!B397","v":0},{"$f":"IMPRIMIR!C397","v":0},{"$f":"IF(E398=0,0,IMPRIMIR!D397)","v":0},{"$f":"IF(E398=0,0,IMPRIMIR!E397)","v":0},0,0,0]
[null,{"$f":"IF(E399=0,0,IMPRIMIR!A398)","v":0},{"$f":"IF(E399=0,0,IMPRIMIR!$D$3)","v":0},0,{"$f":"IMPRIMIR!B398","v":0},{"$f":"IMPRIMIR!C398","v":0},{"$f":"IF(E399=0,0,IMPRIMIR!D398)","v":0},{"$f":"IF(E399=0,0,IMPRIMIR!E398)","v":0},0,0,0]
[null,{"$f":"IF(E400=0,0,IMPRIMIR!A399)","v":0},{"$f":"IF(E400=0,0,IMPRIMIR!$D$3)","v":0},0,{"$f":"IMPRIMIR!B399","v":0},{"$f":"IMPRIMIR!C399","v":0},{"$f":"IF(E400=0,0,IMPRIMIR!D399)","v":0},{"$f":"IF(E400=0,0,IMPRIMIR!E399)","v":0},0,0,0]
[null,{"$f":"IF(E401=0,0,IMPRIMIR!A400)","v":0},{"$f":"IF(E401=0,0,IMPRIMIR!$D$3)","v":0},0,{"$f":"IMPRIMIR!B400","v":0},{"$f":"IMPRIMIR!C400","v":0},{"$f":"IF(E401=0,0,IMPRIMIR!D400)","v":0},{"$f":"IF(E401=0,0,IMPRIMIR!E400)","v":0},0,0,0]
[null,{"$f":"IF(E402=0,0,IMPRIMIR!A401)","v":0},{"$f":"IF(E402=0,0,IMPRIMIR!$D$3)","v":0},0,{"$f":"IMPRIMIR!B401","v":0},{"$f":"IMPRIMIR!C401","v":0},{"$f":"IF(E402=0,0,IMPRIMIR!D401)","v":0},{"$f":"IF(E402=0,0,IMPRIMIR!E401)","v":0},0,0,0]
[null,{"$f":"IF(E403=0,0,IMPRIMIR!A402)","v":0},{"$f":"IF(E403=0,0,IMPRIMIR!$D$3)","v":0},0,{"$f":"IMPRIMIR!B402","v":0},{"$f":"IMPRIMIR!C402","v":0},{"$f":"IF(E403=0,0,IMPRIMIR!D402)","v":0},{"$f":"IF(E403=0,0,IMPRIMIR!E402)","v":0},0,0,0]
[null,{"$f":"IF(E404=0,0,IMPRIMIR!A403)","v":0},{"$f":"IF(E404=0,0,IMPRIMIR!$D$3)","v":0},0,{"$f":"IMPRIMIR!B403","v":0},{"$f":"IMPRIMIR!C403","v":0},{"$f":"IF(E404=0,0,IMPRIMIR!D403)","v":0},{"$f":"IF(E404=0,0,IMPRIMIR!E403)","v":0},0,0,0]
[null,{"$f":"IF(E405=0,0,IMPRIMIR!A404)","v":0},{"$f":"IF(E405=0,0,IMPRIMIR!$D$3)","v":0},0,{"$f":"IMPRIMIR!B404","v":0},{"$f":"IMPRIMIR!C404","v":0},{"$f":"IF(E405=0,0,IMPRIMIR!D404)","v":0},{"$f":"IF(E405=0,0,IMPRIMIR!E404)","v":0},0,0,0]
[null,{"$f":"IF(E406=0,0,IMPRIMIR!A405)","v":0},{"$f":"IF(E406=0,0,IMPRIMIR!$D$3)","v":0},0,{"$f":"IMPRIMIR!B405","v":0},{"$f":"IMPRIMIR!C405","v":0},{"$f":"IF(E406=0,0,IMPRIMIR!D405)","v":0},{"$f":"IF(E406=0,0,IMPRIMIR!E405)","v":0},0,0,0]
[null,{"$f":"IF(E407=0,0,IMPRIMIR!A406)","v":0},{"$f":"IF(E407=0,0,IMPRIMIR!$D$3)","v":0},0,{"$f":"IMPRIMIR!B406","v":0},{"$f":"IMPRIMIR!C406","v":0},{"$f":"IF(E407=0,0,IMPRIMIR!D406)","v":0},{"$f":"IF(E407=0,0,IMPRIMIR!E406)","v":0},0,0,0]
[null,{"$f":"IF(E408=0,0,IMPRIMIR!A407)","v":0},{"$f":"IF(E408=0,0,IMPRIMIR!$D$3)","v":0},0,{"$f":"IMPRIMIR!B407","v":0},{"$f":"IMPRIMIR!C407","v":0},{"$f":"IF(E408=0,0,IMPRIMIR!D407)","v":0},{"$f":"IF(E408=0,0,IMPRIMIR!E407)","v":0},0,0,0]
[null,{"$f":"IF(E409=0,0,IMPRIMIR!A408)","v":0},{"$f":"IF(E409=0,0,IMPRIMIR!$D$3)","v":0},0,{"$f":"IMPRIMIR!B408","v":0},{"$f":"IMPRIMIR!C408","v":0},{"$f":"IF(E409=0,0,IMPRIMIR!D408)","v":0},{"$f":"IF(E409=0,0,IMPRIMIR!E408)","v":0},0,0,0]
[null,{"$f":"IF(E410=0,0,IMPRIMIR!A409)","v":0},{"$f":"IF(E410=0,0,IMPRIMIR!$D$3)","v":0},0,{"$f":"IMPRIMIR!B409","v":0},{"$f":"IMPRIMIR!C409","v":0},{"$f":"IF(E410=0,0,IMPRIMIR!D409)","v":0},{"$f":"IF(E410=0,0,IMPRIMIR!E409)","v":0},0,0,0]
[null,{"$f":"IF(E411=0,0,IMPRIMIR!A410)","v":0},{"$f":"IF(E411=0,0,IMPRIMIR!$D$3)","v":0},0,{"$f":"IMPRIMIR!B410","v":0},{"$f":"IMPRIMIR!C410","v":0},{"$f":"IF(E411=0,0,IMPRIMIR!D410)","v":0},{"$f":"IF(E411=0,0,IMPRIMIR!E410)","v":0},0,0,0]
[null,{"$f":"IF(E412=0,0,IMPRIMIR!A411)","v":0},{"$f":"IF(E412=0,0,IMPRIMIR!$D$3)","v":0},0,{"$f":"IMPRIMIR!B411","v":0},{"$f":"IMPRIMIR!C411","v":0},{"$f":"IF(E412=0,0,IMPRIMIR!D411)","v":0},{"$f":"IF(E412=0,0,IMPRIMIR!E411)","v":0},0,0,0]
[null,{"$f":"IF(E413=0,0,IMPRIMIR!A412)","v":0},{"$f":"IF(E413=0,0,IMPRIMIR!$D$3)","v":0},0,{"$f":"IMPRIMIR!B412","v":0},{"$f":"IMPRIMIR!C412","v":0},{"$f":"IF(E413=0,0,IMPRIMIR!D412)","v":0},{"$f":"IF(E413=0,0,IMPRIMIR!E412)","v":0},0,0,0]
[null,{"$f":"IF(E414=0,0,IMPRIMIR!A413)","v":0},{"$f":"IF(E414=0,0,IMPRIMIR!$D$3)","v":0},0,{"$f":"IMPRIMIR!B413","v":0},{"$f":"IMPRIMIR!C413","v":0},{"$f":"IF(E414=0,0,IMPRIMIR!D413)","v":0},{"$f":"IF(E414=0,0,IMPRIMIR!E413)","v":0},0,0,0]
[null,{"$f":"IF(E415=0,0,IMPRIMIR!A414)","v":0},{"$f":"IF(E415=0,0,IMPRIMIR!$D$3)","v":0},0,{"$f":"IMPRIMIR!B414","v":0},{"$f":"IMPRIMIR!C414","v":0},{"$f":"IF(E415=0,0,IMPRIMIR!D414)","v":0},{"$f":"IF(E415=0,0,IMPRIMIR!E414)","v":0},0,0,0]
[null,{"$f":"IF(E416=0,0,IMPRIMIR!A415)","v":0},{"$f":"IF(E416=0,0,IMPRIMIR!$D$3)","v":0},0,{"$f":"IMPRIMIR!B415","v":0},{"$f":"IMPRIMIR!C415","v":0},{"$f":"IF(E416=0,0,IMPRIMIR!D415)","v":0},{"$f":"IF(E416=0,0,IMPRIMIR!E415)","v":0},0,0,0]
[null,{"$f":"IF(E417=0,0,IMPRIMIR!A416)","v":0},{"$f":"IF(E417=0,0,IMPRIMIR!$D$3)","v":0},0,{"$f":"IMPRIMIR!B416","v":0},{"$f":"IMPRIMIR!C416","v":0},{"$f":"IF(E417=0,0,IMPRIMIR!D416)","v":0},{"$f":"IF(E417=0,0,IMPRIMIR!E416)","v":0},0,0,0]
[null,{"$f":"IF(E418=0,0,IMPRIMIR!A417)","v":0},{"$f":"IF(E418=0,0,IMPRIMIR!$D$3)","v":0},0,{"$f":"IMPRIMIR!B417","v":0},{"$f":"IMPRIMIR!C417","v":0},{"$f":"IF(E418=0,0,IMPRIMIR!D417)","v":0},{"$f":"IF(E418=0,0,IMPRIMIR!E417)","v":0},0,0,0]
[null,{"$f":"IF(E419=0,0,IMPRIMIR!A418)","v":0},{"$f":"IF(E419=0,0,IMPRIMIR!$D$3)","v":0},0,{"$f":"IMPRIMIR!B418","v":0},{"$f":"IMPRIMIR!C418","v":0},{"$f":"IF(E419=0,0,IMPRIMIR!D418)","v":0},{"$f":"IF(E419=0,0,IMPRIMIR!E418)","v":0},0,0,0]
[null,{"$f":"IF(E420=0,0,IMPRIMIR!A419)","v":0},{"$f":"IF(E420=0,0,IMPRIMIR!$D$3)","v":0},0,{"$f":"IMPRIMIR!B419","v":0},{"$f":"IMPRIMIR!C419","v":0},{"$f":"IF(E420=0,0,IMPRIMIR!D419)","v":0},{"$f":"IF(E420=0,0,IMPRIMIR!E419)","v":0},0,0,0]
[null,{"$f":"IF(E421=0,0,IMPRIMIR!A420)","v":0},{"$f":"IF(E421=0,0,IMPRIMIR!$D$3)","v":0},0,{"$f":"IMPRIMIR!B420","v":0},{"$f":"IMPRIMIR!C420","v":0},{"$f":"IF(E421=0,0,IMPRIMIR!D420)","v":0},{"$f":"IF(E421=0,0,IMPRIMIR!E420)","v":0},0,0,0]
[null,{"$f":"IF(E422=0,0,IMPRIMIR!A421)","v":0},{"$f":"IF(E422=0,0,IMPRIMIR!$D$3)","v":0},0,{"$f":"IMPRIMIR!B421","v":0},{"$f":"IMPRIMIR!C421","v":0},{"$f":"IF(E422=0,0,IMPRIMIR!D421)","v":0},{"$f":"IF(E422=0,0,IMPRIMIR!E421)","v":0},0,0,0]
[null,{"$f":"IF(E423=0,0,IMPRIMIR!A422)","v":0},{"$f":"IF(E423=0,0,IMPRIMIR!$D$3)","v":0},0,{"$f":"IMPRIMIR!B422","v":0},{"$f":"IMPRIMIR!C422","v":0},{"$f":"IF(E423=0,0,IMPRIMIR!D422)","v":0},{"$f":"IF(E423=0,0,IMPRIMIR!E422)","v":0},0,0,0]
[null,{"$f":"IF(E424=0,0,IMPRIMIR!A423)","v":0},{"$f":"IF(E424=0,0,IMPRIMIR!$D$3)","v":0},0,{"$f":"IMPRIMIR!B423","v":0},{"$f":"IMPRIMIR!C423","v":0},{"$f":"IF(E424=0,0,IMPRIMIR!D423)","v":0},{"$f":"IF(E424=0,0,IMPRIMIR!E423)","v":0},0,0,0]
[null,{"$f":"IF(E425=0,0,IMPRIMIR!A424)","v":0},{"$f":"IF(E425=0,0,IMPRIMIR!$D$3)","v":0},0,{"$f":"IMPRIMIR!B424","v":0},{"$f":"IMPRIMIR!C424","v":0},{"$f":"IF(E425=0,0,IMPRIMIR!D424)","v":0},{"$f":"IF(E425=0,0,IMPRIMIR!E424)","v":0},0,0,0]
[null,{"$f":"IF(E426=0,0,IMPRIMIR!A425)","v":0},{"$f":"IF(E426=0,0,IMPRIMIR!$D$3)","v":0},0,{"$f":"IMPRIMIR!B425","v":0},{"$f":"IMPRIMIR!C425","v":0},{"$f":"IF(E426=0,0,IMPRIMIR!D425)","v":0},{"$f":"IF(E426=0,0,IMPRIMIR!E425)","v":0},0,0,0]
[null,{"$f":"IF(E427=0,0,IMPRIMIR!A426)","v":0},{"$f":"IF(E427=0,0,IMPRIMIR!$D$3)","v":0},0,{"$f":"IMPRIMIR!B426","v":0},{"$f":"IMPRIMIR!C426","v":0},{"$f":"IF(E427=0,0,IMPRIMIR!D426)","v":0},{"$f":"IF(E427=0,0,IMPRIMIR!E426)","v":0},0,0,0]
[null,{"$f":"IF(E428=0,0,IMPRIMIR!A427)","v":0},{"$f":"IF(E428=0,0,IMPRIMIR!$D$3)","v":0},0,{"$f":"IMPRIMIR!B427","v":0},{"$f":"IMPRIMIR!C427","v":0},{"$f":"IF(E428=0,0,IMPRIMIR!D427)","v":0},{"$f":"IF(E428=0,0,IMPRIMIR!E427)","v":0},0,0,0]
[null,{"$f":"IF(E429=0,0,IMPRIMIR!A428)","v":0},{"$f":"IF(E429=0,0,IMPRIMIR!$D$3)","v":0},0,{"$f":"IMPRIMIR!B428","v":0},{"$f":"IMPRIMIR!C428","v":0},{"$f":"IF(E429=0,0,IMPRIMIR!D428)","v":0},{"$f":"IF(E429=0,0,IMPRIMIR!E428)","v":0},0,0,0]
[null,{"$f":"IF(E430=0,0,IMPRIMIR!A429)","v":0},{"$f":"IF(E430=0,0,IMPRIMIR!$D$3)","v":0},0,{"$f":"IMPRIMIR!B429","v":0},{"$f":"IMPRIMIR!C429","v":0},{"$f":"IF(E430=0,0,IMPRIMIR!D429)","v":0},{"$f":"IF(E430=0,0,IMPRIMIR!E429)","v":0},0,0,0]
[null,{"$f":"IF(E431=0,0,IMPRIMIR!A430)","v":0},{"$f":"IF(E431=0,0,IMPRIMIR!$D$3)","v":0},0,{"$f":"IMPRIMIR!B430","v":0},{"$f":"IMPRIMIR!C430","v":0},{"$f":"IF(E431=0,0,IMPRIMIR!D430)","v":0},{"$f":"IF(E431=0,0,IMPRIMIR!E430)","v":0},0,0,0]
[null,{"$f":"IF(E432=0,0,IMPRIMIR!A431)","v":0},{"$f":"IF(E432=0,0,IMPRIMIR!$D$3)","v":0},0,{"$f":"IMPRIMIR!B431","v":0},{"$f":"IMPRIMIR!C431","v":0},{"$f":"IF(E432=0,0,IMPRIMIR!D431)","v":0},{"$f":"IF(E432=0,0,IMPRIMIR!E431)","v":0},0,0,0]
[null,{"$f":"IF(E433=0,0,IMPRIMIR!A432)","v":0},{"$f":"IF(E433=0,0,IMPRIMIR!$D$3)","v":0},0,{"$f":"IMPRIMIR!B432","v":0},{"$f":"IMPRIMIR!C432","v":0},{"$f":"IF(E433=0,0,IMPRIMIR!D432)","v":0},{"$f":"IF(E433=0,0,IMPRIMIR!E432)","v":0},0,0,0]
[null,{"$f":"IF(E434=0,0,IMPRIMIR!A433)","v":0},{"$f":"IF(E434=0,0,IMPRIMIR!$D$3)","v":0},0,{"$f":"IMPRIMIR!B433","v":0},{"$f":"IMPRIMIR!C433","v":0},{"$f":"IF(E434=0,0,IMPRIMIR!D433)","v":0},{"$f":"IF(E434=0,0,IMPRIMIR!E433)","v":0},0,0,0]
[null,{"$f":"IF(E435=0,0,IMPRIMIR!A434)","v":0},{"$f":"IF(E435=0,0,IMPRIMIR!$D$3)","v":0},0,{"$f":"IMPRIMIR!B434","v":0},{"$f":"IMPRIMIR!C434","v":0},{"$f":"IF(E435=0,0,IMPRIMIR!D434)","v":0},{"$f":"IF(E435=0,0,IMPRIMIR!E434)","v":0},0,0,0]
[null,{"$f":"IF(E436=0,0,IMPRIMIR!A435)","v":0},{"$f":"IF(E436=0,0,IMPRIMIR!$D$3)","v":0},0,{"$f":"IMPRIMIR!B435","v":0},{"$f":"IMPRIMIR!C435","v":0},{"$f":"IF(E436=0,0,IMPRIMIR!D435)","v":0},{"$f":"IF(E436=0,0,IMPRIMIR!E435)","v":0},0,0,0]
[null,{"$f":"IF(E437=0,0,IMPRIMIR!A436)","v":0},{"$f":"IF(E437=0,0,IMPRIMIR!$D$3)","v":0},0,{"$f":"IMPRIMIR!B436","v":0},{"$f":"IMPRIMIR!C436","v":0},{"$f":"IF(E437=0,0,IMPRIMIR!D436)","v":0},{"$f":"IF(E437=0,0,IMPRIMIR!E436)","v":0},0,0,0]
[null,{"$f":"IF(E438=0,0,IMPRIMIR!A437)","v":0},{"$f":"IF(E438=0,0,IMPRIMIR!$D$3)","v":0},0,{"$f":"IMPRIMIR!B437","v":0},{"$f":"IMPRIMIR!C437","v":0},{"$f":"IF(E438=0,0,IMPRIMIR!D437)","v":0},{"$f":"IF(E438=0,0,IMPRIMIR!E437)","v":0},0,0,0]
[null,{"$f":"IF(E439=0,0,IMPRIMIR!A438)","v":0},{"$f":"IF(E439=0,0,IMPRIMIR!$D$3)","v":0},0,{"$f":"IMPRIMIR!B438","v":0},{"$f":"IMPRIMIR!C438","v":0},{"$f":"IF(E439=0,0,IMPRIMIR!D438)","v":0},{"$f":"IF(E439=0,0,IMPRIMIR!E438)","v":0},0,0,0]
[null,{"$f":"IF(E440=0,0,IMPRIMIR!A439)","v":0},{"$f":"IF(E440=0,0,IMPRIMIR!$D$3)","v":0},0,{"$f":"IMPRIMIR!B439","v":0},{"$f":"IMPRIMIR!C439","v":0},{"$f":"IF(E440=0,0,IMPRIMIR!D439)","v":0},{"$f":"IF(E440=0,0,IMPRIMIR!E439)","v":0},0,0,0]
[null,{"$f":"IF(E441=0,0,IMPRIMIR!A440)","v":0},{"$f":"IF(E441=0,0,IMPRIMIR!$D$3)","v":0},0,{"$f":"IMPRIMIR!B440","v":0},{"$f":"IMPRIMIR!C440","v":0},{"$f":"IF(E441=0,0,IMPRIMIR!D440)","v":0},{"$f":"IF(E441=0,0,IMPRIMIR!E440)","v":0},0,0,0]
[null,{"$f":"IF(E442=0,0,IMPRIMIR!A441)","v":0},{"$f":"IF(E442=0,0,IMPRIMIR!$D$3)","v":0},0,{"$f":"IMPRIMIR!B441","v":0},{"$f":"IMPRIMIR!C441","v":0},{"$f":"IF(E442=0,0,IMPRIMIR!D441)","v":0},{"$f":"IF(E442=0,0,IMPRIMIR!E441)","v":0},0,0,0]
[null,{"$f":"IF(E443=0,0,IMPRIMIR!A442)","v":0},{"$f":"IF(E443=0,0,IMPRIMIR!$D$3)","v":0},0,{"$f":"IMPRIMIR!B442","v":0},{"$f":"IMPRIMIR!C442","v":0},{"$f":"IF(E443=0,0,IMPRIMIR!D442)","v":0},{"$f":"IF(E443=0,0,IMPRIMIR!E442)","v":0},0,0,0]
[null,{"$f":"IF(E444=0,0,IMPRIMIR!A443)","v":0},{"$f":"IF(E444=0,0,IMPRIMIR!$D$3)","v":0},0,{"$f":"IMPRIMIR!B443","v":0},{"$f":"IMPRIMIR!C443","v":0},{"$f":"IF(E444=0,0,IMPRIMIR!D443)","v":0},{"$f":"IF(E444=0,0,IMPRIMIR!E443)","v":0},0,0,0]
[null,{"$f":"IF(E445=0,0,IMPRIMIR!A444)","v":0},{"$f":"IF(E445=0,0,IMPRIMIR!$D$3)","v":0},0,{"$f":"IMPRIMIR!B444","v":0},{"$f":"IMPRIMIR!C444","v":0},{"$f":"IF(E445=0,0,IMPRIMIR!D444)","v":0},{"$f":"IF(E445=0,0,IMPRIMIR!E444)","v":0},0,0,0]
[null,{"$f":"IF(E446=0,0,IMPRIMIR!A445)","v":0},{"$f":"IF(E446=0,0,IMPRIMIR!$D$3)","v":0},0,{"$f":"IMPRIMIR!B445","v":0},{"$f":"IMPRIMIR!C445","v":0},{"$f":"IF(E446=0,0,IMPRIMIR!D445)","v":0},{"$f":"IF(E446=0,0,IMPRIMIR!E445)","v":0},0,0,0]
[null,{"$f":"IF(E447=0,0,IMPRIMIR!A446)","v":0},{"$f":"IF(E447=0,0,IMPRIMIR!$D$3)","v":0},0,{"$f":"IMPRIMIR!B446","v":0},{"$f":"IMPRIMIR!C446","v":0},{"$f":"IF(E447=0,0,IMPRIMIR!D446)","v":0},{"$f":"IF(E447=0,0,IMPRIMIR!E446)","v":0},0,0,0]
[null,{"$f":"IF(E448=0,0,IMPRIMIR!A447)","v":0},{"$f":"IF(E448=0,0,IMPRIMIR!$D$3)","v":0},0,{"$f":"IMPRIMIR!B447","v":0},{"$f":"IMPRIMIR!C447","v":0},{"$f":"IF(E448=0,0,IMPRIMIR!D447)","v":0},{"$f":"IF(E448=0,0,IMPRIMIR!E447)","v":0},0,0,0]
[null,{"$f":"IF(E449=0,0,IMPRIMIR!A448)","v":0},{"$f":"IF(E449=0,0,IMPRIMIR!$D$3)","v":0},0,{"$f":"IMPRIMIR!B448","v":0},{"$f":"IMPRIMIR!C448","v":0},{"$f":"IF(E449=0,0,IMPRIMIR!D448)","v":0},{"$f":"IF(E449=0,0,IMPRIMIR!E448)","v":0},0,0,0]
[null,{"$f":"IF(E450=0,0,IMPRIMIR!A449)","v":0},{"$f":"IF(E450=0,0,IMPRIMIR!$D$3)","v":0},0,{"$f":"IMPRIMIR!B449","v":0},{"$f":"IMPRIMIR!C449","v":0},{"$f":"IF(E450=0,0,IMPRIMIR!D449)","v":0},{"$f":"IF(E450=0,0,IMPRIMIR!E449)","v":0},0,0,0]
[null,{"$f":"IF(E451=0,0,IMPRIMIR!A450)","v":0},{"$f":"IF(E451=0,0,IMPRIMIR!$D$3)","v":0},0,{"$f":"IMPRIMIR!B450","v":0},{"$f":"IMPRIMIR!C450","v":0},{"$f":"IF(E451=0,0,IMPRIMIR!D450)","v":0},{"$f":"IF(E451=0,0,IMPRIMIR!E450)","v":0},0,0,0]
[null,{"$f":"IF(E452=0,0,IMPRIMIR!A451)","v":0},{"$f":"IF(E452=0,0,IMPRIMIR!$D$3)","v":0},0,{"$f":"IMPRIMIR!B451","v":0},{"$f":"IMPRIMIR!C451","v":0},{"$f":"IF(E452=0,0,IMPRIMIR!D451)","v":0},{"$f":"IF(E452=0,0,IMPRIMIR!E451)","v":0},0,0,0]
[null,{"$f":"IF(E453=0,0,IMPRIMIR!A452)","v":0},{"$f":"IF(E453=0,0,IMPRIMIR!$D$3)","v":0},0,{"$f":"IMPRIMIR!B452","v":0},{"$f":"IMPRIMIR!C452","v":0},{"$f":"IF(E453=0,0,IMPRIMIR!D452)","v":0},{"$f":"IF(E453=0,0,IMPRIMIR!E452)","v":0},0,0,0]
[null,{"$f":"IF(E454=0,0,IMPRIMIR!A453)","v":0},{"$f":"IF(E454=0,0,IMPRIMIR!$D$3)","v":0},0,{"$f":"IMPRIMIR!B453","v":0},{"$f":"IMPRIMIR!C453","v":0},{"$f":"IF(E454=0,0,IMPRIMIR!D453)","v":0},{"$f":"IF(E454=0,0,IMPRIMIR!E453)","v":0},0,0,0]
[null,{"$f":"IF(E455=0,0,IMPRIMIR!A454)","v":0},{"$f":"IF(E455=0,0,IMPRIMIR!$D$3)","v":0},0,{"$f":"IMPRIMIR!B454","v":0},{"$f":"IMPRIMIR!C454","v":0},{"$f":"IF(E455=0,0,IMPRIMIR!D454)","v":0},{"$f":"IF(E455=0,0,IMPRIMIR!E454)","v":0},0,0,0]
[null,{"$f":"IF(E456=0,0,IMPRIMIR!A455)","v":0},{"$f":"IF(E456=0,0,IMPRIMIR!$D$3)","v":0},0,{"$f":"IMPRIMIR!B455","v":0},{"$f":"IMPRIMIR!C455","v":0},{"$f":"IF(E456=0,0,IMPRIMIR!D455)","v":0},{"$f":"IF(E456=0,0,IMPRIMIR!E455)","v":0},0,0,0]
[null,{"$f":"IF(E457=0,0,IMPRIMIR!A456)","v":0},{"$f":"IF(E457=0,0,IMPRIMIR!$D$3)","v":0},{"$f":"IF(E457=\"0\",0,$G$2)","v":0},{"$f":"IMPRIMIR!B456","v":0},{"$f":"IMPRIMIR!C456","v":0},{"$f":"IF(E457=0,0,IMPRIMIR!D456)","v":0},{"$f":"IF(E457=0,0,IMPRIMIR!E456)","v":0},{"$f":"IF(E457=0,0,$G$2)","v":0},{"$f":"IF(E457=0,0,$G$4)","v":0},{"$f":"IF(E457=0,0,$G$3)","v":0}]
[null,{"$f":"IF(E458=0,0,IMPRIMIR!A457)","v":0},{"$f":"IF(E458=0,0,IMPRIMIR!$D$3)","v":0},0,{"$f":"IMPRIMIR!B457","v":0},{"$f":"IMPRIMIR!C457","v":0},{"$f":"IF(E458=0,0,IMPRIMIR!D457)","v":0},{"$f":"IF(E458=0,0,IMPRIMIR!E457)","v":0},0,0,0]
[null,{"$f":"IF(E459=0,0,IMPRIMIR!A458)","v":0},{"$f":"IF(E459=0,0,IMPRIMIR!$D$3)","v":0},0,{"$f":"IMPRIMIR!B458","v":0},{"$f":"IMPRIMIR!C458","v":0},{"$f":"IF(E459=0,0,IMPRIMIR!D458)","v":0},{"$f":"IF(E459=0,0,IMPRIMIR!E458)","v":0},0,0,0]
[null,{"$f":"IF(E460=0,0,IMPRIMIR!A459)","v":0},{"$f":"IF(E460=0,0,IMPRIMIR!$D$3)","v":0},0,{"$f":"IMPRIMIR!B459","v":0},{"$f":"IMPRIMIR!C459","v":0},{"$f":"IF(E460=0,0,IMPRIMIR!D459)","v":0},{"$f":"IF(E460=0,0,IMPRIMIR!E459)","v":0},0,0,0]
[null,{"$f":"IF(E461=0,0,IMPRIMIR!A460)","v":0},{"$f":"IF(E461=0,0,IMPRIMIR!$D$3)","v":0},0,{"$f":"IMPRIMIR!B460","v":0},{"$f":"IMPRIMIR!C460","v":0},{"$f":"IF(E461=0,0,IMPRIMIR!D460)","v":0},{"$f":"IF(E461=0,0,IMPRIMIR!E460)","v":0},0,0,0]
[null,{"$f":"IF(E462=0,0,IMPRIMIR!A461)","v":0},{"$f":"IF(E462=0,0,IMPRIMIR!$D$3)","v":0},0,{"$f":"IMPRIMIR!B461","v":0},{"$f":"IMPRIMIR!C461","v":0},{"$f":"IF(E462=0,0,IMPRIMIR!D461)","v":0},{"$f":"IF(E462=0,0,IMPRIMIR!E461)","v":0},0,0,0]
[null,{"$f":"IF(E463=0,0,IMPRIMIR!A462)","v":0},{"$f":"IF(E463=0,0,IMPRIMIR!$D$3)","v":0},0,{"$f":"IMPRIMIR!B462","v":0},{"$f":"IMPRIMIR!C462","v":0},{"$f":"IF(E463=0,0,IMPRIMIR!D462)","v":0},{"$f":"IF(E463=0,0,IMPRIMIR!E462)","v":0},0,0,0]
[null,{"$f":"IF(E464=0,0,IMPRIMIR!A463)","v":0},{"$f":"IF(E464=0,0,IMPRIMIR!$D$3)","v":0},0,{"$f":"IMPRIMIR!B463","v":0},{"$f":"IMPRIMIR!C463","v":0},{"$f":"IF(E464=0,0,IMPRIMIR!D463)","v":0},{"$f":"IF(E464=0,0,IMPRIMIR!E463)","v":0},0,0,0]
[null,{"$f":"IF(E465=0,0,IMPRIMIR!A464)","v":0},{"$f":"IF(E465=0,0,IMPRIMIR!$D$3)","v":0},0,{"$f":"IMPRIMIR!B464","v":0},{"$f":"IMPRIMIR!C464","v":0},{"$f":"IF(E465=0,0,IMPRIMIR!D464)","v":0},{"$f":"IF(E465=0,0,IMPRIMIR!E464)","v":0},0,0,0]
[null,{"$f":"IF(E466=0,0,IMPRIMIR!A465)","v":0},{"$f":"IF(E466=0,0,IMPRIMIR!$D$3)","v":0},0,{"$f":"IMPRIMIR!B465","v":0},{"$f":"IMPRIMIR!C465","v":0},{"$f":"IF(E466=0,0,IMPRIMIR!D465)","v":0},{"$f":"IF(E466=0,0,IMPRIMIR!E465)","v":0},0,0,0]
[null,{"$f":"IF(E467=0,0,IMPRIMIR!A466)","v":0},{"$f":"IF(E467=0,0,IMPRIMIR!$D$3)","v":0},0,{"$f":"IMPRIMIR!B466","v":0},{"$f":"IMPRIMIR!C466","v":0},{"$f":"IF(E467=0,0,IMPRIMIR!D466)","v":0},{"$f":"IF(E467=0,0,IMPRIMIR!E466)","v":0},0,0,0]
[null,{"$f":"IF(E468=0,0,IMPRIMIR!A467)","v":0},{"$f":"IF(E468=0,0,IMPRIMIR!$D$3)","v":0},0,{"$f":"IMPRIMIR!B467","v":0},{"$f":"IMPRIMIR!C467","v":0},{"$f":"IF(E468=0,0,IMPRIMIR!D467)","v":0},{"$f":"IF(E468=0,0,IMPRIMIR!E467)","v":0},0,0,0]
[null,{"$f":"IF(E469=0,0,IMPRIMIR!A468)","v":0},{"$f":"IF(E469=0,0,IMPRIMIR!$D$3)","v":0},0,{"$f":"IMPRIMIR!B468","v":0},{"$f":"IMPRIMIR!C468","v":0},{"$f":"IF(E469=0,0,IMPRIMIR!D468)","v":0},{"$f":"IF(E469=0,0,IMPRIMIR!E468)","v":0},0,0,0]
[null,{"$f":"IF(E470=0,0,IMPRIMIR!A469)","v":0},{"$f":"IF(E470=0,0,IMPRIMIR!$D$3)","v":0},0,{"$f":"IMPRIMIR!B469","v":0},{"$f":"IMPRIMIR!C469","v":0},{"$f":"IF(E470=0,0,IMPRIMIR!D469)","v":0},{"$f":"IF(E470=0,0,IMPRIMIR!E469)","v":0},0,0,0]
[null,{"$f":"IF(E471=0,0,IMPRIMIR!A470)","v":0},{"$f":"IF(E471=0,0,IMPRIMIR!$D$3)","v":0},0,{"$f":"IMPRIMIR!B470","v":0},{"$f":"IMPRIMIR!C470","v":0},{"$f":"IF(E471=0,0,IMPRIMIR!D470)","v":0},{"$f":"IF(E471=0,0,IMPRIMIR!E470)","v":0},0,0,0]
[null,{"$f":"IF(E472=0,0,IMPRIMIR!A471)","v":"h CAP. INTEG. TOT FORM."},{"$f":"IF(E472=0,0,IMPRIMIR!$D$3)","v":0},0,{"$f":"IMPRIMIR!B471","v":"0"},{"$f":"IMPRIMIR!C471","v":"0"},{"$f":"IF(E472=0,0,IMPRIMIR!D471)","v":"CAPITAL MÍNIMO A INTEGRAR TOTAL (SOCIOS DE ESTE FORM):"},{"$f":"IF(E472=0,0,IMPRIMIR!E471)","v":"INCOMPLETO RECHAZAR"},0,0,0]
[null,{"$f":"IF(E473=0,0,IMPRIMIR!A472)","v":0},{"$f":"IF(E473=0,0,IMPRIMIR!$D$3)","v":0},0,{"$f":"IMPRIMIR!B472","v":0},{"$f":"IMPRIMIR!C472","v":0},{"$f":"IF(E473=0,0,IMPRIMIR!D472)","v":0},{"$f":"IF(E473=0,0,IMPRIMIR!E472)","v":0},0,0,0]
[null,{"$f":"IF(E474=0,0,IMPRIMIR!A473)","v":0},{"$f":"IF(E474=0,0,IMPRIMIR!$D$3)","v":0},0,{"$f":"IMPRIMIR!B473","v":0},{"$f":"IMPRIMIR!C473","v":0},{"$f":"IF(E474=0,0,IMPRIMIR!D473)","v":0},{"$f":"IF(E474=0,0,IMPRIMIR!E473)","v":0},0,0,0]
[null,{"$f":"IF(E475=0,0,IMPRIMIR!A474)","v":0},{"$f":"IF(E475=0,0,IMPRIMIR!$D$3)","v":0},0,{"$f":"IMPRIMIR!B474","v":0},{"$f":"IMPRIMIR!C474","v":0},{"$f":"IF(E475=0,0,IMPRIMIR!D474)","v":0},{"$f":"IF(E475=0,0,IMPRIMIR!E474)","v":0},0,0,0]
[null,{"$f":"IF(E476=0,0,IMPRIMIR!A475)","v":0},{"$f":"IF(E476=0,0,IMPRIMIR!$D$3)","v":0},0,{"$f":"IMPRIMIR!B475","v":0},{"$f":"IMPRIMIR!C475","v":0},{"$f":"IF(E476=0,0,IMPRIMIR!D475)","v":0},{"$f":"IF(E476=0,0,IMPRIMIR!E475)","v":0},0,0,0]
[null,{"$f":"IF(E477=0,0,IMPRIMIR!A476)","v":0},{"$f":"IF(E477=0,0,IMPRIMIR!$D$3)","v":0},0,{"$f":"IMPRIMIR!B476","v":0},{"$f":"IMPRIMIR!C476","v":0},{"$f":"IF(E477=0,0,IMPRIMIR!D476)","v":0},{"$f":"IF(E477=0,0,IMPRIMIR!E476)","v":0},0,0,0]
[null,{"$f":"IF(E478=0,0,IMPRIMIR!A477)","v":0},{"$f":"IF(E478=0,0,IMPRIMIR!$D$3)","v":0},0,{"$f":"IMPRIMIR!B477","v":0},{"$f":"IMPRIMIR!C477","v":0},{"$f":"IF(E478=0,0,IMPRIMIR!D477)","v":0},{"$f":"IF(E478=0,0,IMPRIMIR!E477)","v":0},0,0,0]
[null,{"$f":"IF(E479=0,0,IMPRIMIR!A478)","v":0},{"$f":"IF(E479=0,0,IMPRIMIR!$D$3)","v":0},0,{"$f":"IMPRIMIR!B478","v":0},{"$f":"IMPRIMIR!C478","v":0},{"$f":"IF(E479=0,0,IMPRIMIR!D478)","v":0},{"$f":"IF(E479=0,0,IMPRIMIR!E478)","v":0},0,0,0]
[null,{"$f":"IF(E480=0,0,IMPRIMIR!A479)","v":0},{"$f":"IF(E480=0,0,IMPRIMIR!$D$3)","v":0},0,{"$f":"IMPRIMIR!B479","v":0},{"$f":"IMPRIMIR!C479","v":0},{"$f":"IF(E480=0,0,IMPRIMIR!D479)","v":0},{"$f":"IF(E480=0,0,IMPRIMIR!E479)","v":0},0,0,0]
[null,{"$f":"IF(E481=0,0,IMPRIMIR!A480)","v":0},{"$f":"IF(E481=0,0,IMPRIMIR!$D$3)","v":0},0,{"$f":"IMPRIMIR!B480","v":0},{"$f":"IMPRIMIR!C480","v":0},{"$f":"IF(E481=0,0,IMPRIMIR!D480)","v":0},{"$f":"IF(E481=0,0,IMPRIMIR!E480)","v":0},0,0,0]
[null,{"$f":"IF(E482=0,0,IMPRIMIR!A481)","v":0},{"$f":"IF(E482=0,0,IMPRIMIR!$D$3)","v":0},0,{"$f":"IMPRIMIR!B481","v":0},{"$f":"IMPRIMIR!C481","v":0},{"$f":"IF(E482=0,0,IMPRIMIR!D481)","v":0},{"$f":"IF(E482=0,0,IMPRIMIR!E481)","v":0},0,0,0]
[null,{"$f":"IF(E483=0,0,IMPRIMIR!A482)","v":0},{"$f":"IF(E483=0,0,IMPRIMIR!$D$3)","v":0},0,{"$f":"IMPRIMIR!B482","v":0},{"$f":"IMPRIMIR!C482","v":0},{"$f":"IF(E483=0,0,IMPRIMIR!D482)","v":0},{"$f":"IF(E483=0,0,IMPRIMIR!E482)","v":0},0,0,0]
[null,{"$f":"IF(E484=0,0,IMPRIMIR!A483)","v":0},{"$f":"IF(E484=0,0,IMPRIMIR!$D$3)","v":0},0,{"$f":"IMPRIMIR!B483","v":0},{"$f":"IMPRIMIR!C483","v":0},{"$f":"IF(E484=0,0,IMPRIMIR!D483)","v":0},{"$f":"IF(E484=0,0,IMPRIMIR!E483)","v":0},0,0,0]
[null,{"$f":"IF(E485=0,0,IMPRIMIR!A484)","v":0},{"$f":"IF(E485=0,0,IMPRIMIR!$D$3)","v":0},0,{"$f":"IMPRIMIR!B484","v":0},{"$f":"IMPRIMIR!C484","v":0},{"$f":"IF(E485=0,0,IMPRIMIR!D484)","v":0},{"$f":"IF(E485=0,0,IMPRIMIR!E484)","v":0},0,0,0]
[null,{"$f":"IF(E486=0,0,IMPRIMIR!A485)","v":0},{"$f":"IF(E486=0,0,IMPRIMIR!$D$3)","v":0},0,{"$f":"IMPRIMIR!B485","v":0},{"$f":"IMPRIMIR!C485","v":0},{"$f":"IF(E486=0,0,IMPRIMIR!D485)","v":0},{"$f":"IF(E486=0,0,IMPRIMIR!E485)","v":0},0,0,0]
[null,{"$f":"IF(E487=0,0,IMPRIMIR!A486)","v":0},{"$f":"IF(E487=0,0,IMPRIMIR!$D$3)","v":0},0,{"$f":"IMPRIMIR!B486","v":0},{"$f":"IMPRIMIR!C486","v":0},{"$f":"IF(E487=0,0,IMPRIMIR!D486)","v":0},{"$f":"IF(E487=0,0,IMPRIMIR!E486)","v":0},0,0,0]
[null,{"$f":"IF(E488=0,0,IMPRIMIR!A487)","v":0},{"$f":"IF(E488=0,0,IMPRIMIR!$D$3)","v":0},0,{"$f":"IMPRIMIR!B487","v":0},{"$f":"IMPRIMIR!C487","v":0},{"$f":"IF(E488=0,0,IMPRIMIR!D487)","v":0},{"$f":"IF(E488=0,0,IMPRIMIR!E487)","v":0},0,0,0]
[null,{"$f":"IF(E489=0,0,IMPRIMIR!A488)","v":0},{"$f":"IF(E489=0,0,IMPRIMIR!$D$3)","v":0},0,{"$f":"IMPRIMIR!B488","v":0},{"$f":"IMPRIMIR!C488","v":0},{"$f":"IF(E489=0,0,IMPRIMIR!D488)","v":0},{"$f":"IF(E489=0,0,IMPRIMIR!E488)","v":0},0,0,0]
[null,{"$f":"IF(E490=0,0,IMPRIMIR!A489)","v":0},{"$f":"IF(E490=0,0,IMPRIMIR!$D$3)","v":0},0,{"$f":"IMPRIMIR!B489","v":0},{"$f":"IMPRIMIR!C489","v":0},{"$f":"IF(E490=0,0,IMPRIMIR!D489)","v":0},{"$f":"IF(E490=0,0,IMPRIMIR!E489)","v":0},0,0,0]
[null,{"$f":"IF(E491=0,0,IMPRIMIR!A490)","v":0},{"$f":"IF(E491=0,0,IMPRIMIR!$D$3)","v":0},0,{"$f":"IMPRIMIR!B490","v":0},{"$f":"IMPRIMIR!C490","v":0},{"$f":"IF(E491=0,0,IMPRIMIR!D490)","v":0},{"$f":"IF(E491=0,0,IMPRIMIR!E490)","v":0},0,0,0]
[null,{"$f":"IF(E492=0,0,IMPRIMIR!A491)","v":0},{"$f":"IF(E492=0,0,IMPRIMIR!$D$3)","v":0},0,{"$f":"IMPRIMIR!B491","v":0},{"$f":"IMPRIMIR!C491","v":0},{"$f":"IF(E492=0,0,IMPRIMIR!D491)","v":0},{"$f":"IF(E492=0,0,IMPRIMIR!E491)","v":0},0,0,0]
[null,{"$f":"IF(E493=0,0,IMPRIMIR!A492)","v":0},{"$f":"IF(E493=0,0,IMPRIMIR!$D$3)","v":0},0,{"$f":"IMPRIMIR!B492","v":0},{"$f":"IMPRIMIR!C492","v":0},{"$f":"IF(E493=0,0,IMPRIMIR!D492)","v":0},{"$f":"IF(E493=0,0,IMPRIMIR!E492)","v":0},0,0,0]
[null,{"$f":"IF(E494=0,0,IMPRIMIR!A493)","v":0},{"$f":"IF(E494=0,0,IMPRIMIR!$D$3)","v":0},0,{"$f":"IMPRIMIR!B493","v":0},{"$f":"IMPRIMIR!C493","v":0},{"$f":"IF(E494=0,0,IMPRIMIR!D493)","v":0},{"$f":"IF(E494=0,0,IMPRIMIR!E493)","v":0},0,0,0]
[null,{"$f":"IF(E495=0,0,IMPRIMIR!A494)","v":0},{"$f":"IF(E495=0,0,IMPRIMIR!$D$3)","v":0},0,{"$f":"IMPRIMIR!B494","v":0},{"$f":"IMPRIMIR!C494","v":0},{"$f":"IF(E495=0,0,IMPRIMIR!D494)","v":0},{"$f":"IF(E495=0,0,IMPRIMIR!E494)","v":0},0,0,0]
[null,{"$f":"IF(E496=0,0,IMPRIMIR!A495)","v":0},{"$f":"IF(E496=0,0,IMPRIMIR!$D$3)","v":0},0,{"$f":"IMPRIMIR!B495","v":0},{"$f":"IMPRIMIR!C495","v":0},{"$f":"IF(E496=0,0,IMPRIMIR!D495)","v":0},{"$f":"IF(E496=0,0,IMPRIMIR!E495)","v":0},0,0,0]
[null,{"$f":"IF(E497=0,0,IMPRIMIR!A496)","v":0},{"$f":"IF(E497=0,0,IMPRIMIR!$D$3)","v":0},0,{"$f":"IMPRIMIR!B496","v":0},{"$f":"IMPRIMIR!C496","v":0},{"$f":"IF(E497=0,0,IMPRIMIR!D496)","v":0},{"$f":"IF(E497=0,0,IMPRIMIR!E496)","v":0},0,0,0]
[null,{"$f":"IF(E498=0,0,IMPRIMIR!A497)","v":0},{"$f":"IF(E498=0,0,IMPRIMIR!$D$3)","v":0},0,{"$f":"IMPRIMIR!B497","v":0},{"$f":"IMPRIMIR!C497","v":0},{"$f":"IF(E498=0,0,IMPRIMIR!D497)","v":0},{"$f":"IF(E498=0,0,IMPRIMIR!E497)","v":0},0,0,0]
[null,{"$f":"IF(E499=0,0,IMPRIMIR!A498)","v":0},{"$f":"IF(E499=0,0,IMPRIMIR!$D$3)","v":0},0,{"$f":"IMPRIMIR!B498","v":0},{"$f":"IMPRIMIR!C498","v":0},{"$f":"IF(E499=0,0,IMPRIMIR!D498)","v":0},{"$f":"IF(E499=0,0,IMPRIMIR!E498)","v":0},0,0,0]
[null,{"$f":"IF(E500=0,0,IMPRIMIR!A499)","v":0},{"$f":"IF(E500=0,0,IMPRIMIR!$D$3)","v":0},0,{"$f":"IMPRIMIR!B499","v":0},{"$f":"IMPRIMIR!C499","v":0},{"$f":"IF(E500=0,0,IMPRIMIR!D499)","v":0},{"$f":"IF(E500=0,0,IMPRIMIR!E499)","v":0},0,0,0]
[null,{"$f":"IF(E501=0,0,IMPRIMIR!A500)","v":0},{"$f":"IF(E501=0,0,IMPRIMIR!$D$3)","v":0},0,{"$f":"IMPRIMIR!B500","v":0},{"$f":"IMPRIMIR!C500","v":0},{"$f":"IF(E501=0,0,IMPRIMIR!D500)","v":0},{"$f":"IF(E501=0,0,IMPRIMIR!E500)","v":0},0,0,0]
[null,{"$f":"IF(E502=0,0,IMPRIMIR!A501)","v":0},{"$f":"IF(E502=0,0,IMPRIMIR!$D$3)","v":0},0,{"$f":"IMPRIMIR!B501","v":0},{"$f":"IMPRIMIR!C501","v":0},{"$f":"IF(E502=0,0,IMPRIMIR!D501)","v":0},{"$f":"IF(E502=0,0,IMPRIMIR!E501)","v":0},0,0,0]
[null,{"$f":"IF(E503=0,0,IMPRIMIR!A502)","v":0},{"$f":"IF(E503=0,0,IMPRIMIR!$D$3)","v":0},0,{"$f":"IMPRIMIR!B502","v":0},{"$f":"IMPRIMIR!C502","v":0},{"$f":"IF(E503=0,0,IMPRIMIR!D502)","v":0},{"$f":"IF(E503=0,0,IMPRIMIR!E502)","v":0},0,0,0]
[null,{"$f":"IF(E504=0,0,IMPRIMIR!A503)","v":0},{"$f":"IF(E504=0,0,IMPRIMIR!$D$3)","v":0},0,{"$f":"IMPRIMIR!B503","v":0},{"$f":"IMPRIMIR!C503","v":0},{"$f":"IF(E504=0,0,IMPRIMIR!D503)","v":0},{"$f":"IF(E504=0,0,IMPRIMIR!E503)","v":0},0,0,0]
[null,{"$f":"IF(E505=0,0,IMPRIMIR!A504)","v":0},{"$f":"IF(E505=0,0,IMPRIMIR!$D$3)","v":0},0,{"$f":"IMPRIMIR!B504","v":0},{"$f":"IMPRIMIR!C504","v":0},{"$f":"IF(E505=0,0,IMPRIMIR!D504)","v":0},{"$f":"IF(E505=0,0,IMPRIMIR!E504)","v":0},0,0,0]
[null,{"$f":"IF(E506=0,0,IMPRIMIR!A505)","v":0},{"$f":"IF(E506=0,0,IMPRIMIR!$D$3)","v":0},0,{"$f":"IMPRIMIR!B505","v":0},{"$f":"IMPRIMIR!C505","v":0},{"$f":"IF(E506=0,0,IMPRIMIR!D505)","v":0},{"$f":"IF(E506=0,0,IMPRIMIR!E505)","v":0},0,0,0]
[null,{"$f":"IF(E507=0,0,IMPRIMIR!A506)","v":0},{"$f":"IF(E507=0,0,IMPRIMIR!$D$3)","v":0},0,{"$f":"IMPRIMIR!B506","v":0},{"$f":"IMPRIMIR!C506","v":0},{"$f":"IF(E507=0,0,IMPRIMIR!D506)","v":0},{"$f":"IF(E507=0,0,IMPRIMIR!E506)","v":0},0,0,0]
[null,{"$f":"IF(E508=0,0,IMPRIMIR!A507)","v":0},{"$f":"IF(E508=0,0,IMPRIMIR!$D$3)","v":0},0,{"$f":"IMPRIMIR!B507","v":0},{"$f":"IMPRIMIR!C507","v":0},{"$f":"IF(E508=0,0,IMPRIMIR!D507)","v":0},{"$f":"IF(E508=0,0,IMPRIMIR!E507)","v":0},0,0,0]
[null,{"$f":"IF(E509=0,0,IMPRIMIR!A508)","v":0},{"$f":"IF(E509=0,0,IMPRIMIR!$D$3)","v":0},0,{"$f":"IMPRIMIR!B508","v":0},{"$f":"IMPRIMIR!C508","v":0},{"$f":"IF(E509=0,0,IMPRIMIR!D508)","v":0},{"$f":"IF(E509=0,0,IMPRIMIR!E508)","v":0},0,0,0]
[null,{"$f":"IF(E510=0,0,IMPRIMIR!A509)","v":0},{"$f":"IF(E510=0,0,IMPRIMIR!$D$3)","v":0},0,{"$f":"IMPRIMIR!B509","v":0},{"$f":"IMPRIMIR!C509","v":0},{"$f":"IF(E510=0,0,IMPRIMIR!D509)","v":0},{"$f":"IF(E510=0,0,IMPRIMIR!E509)","v":0},0,0,0]
[null,{"$f":"IF(E511=0,0,IMPRIMIR!A510)","v":0},{"$f":"IF(E511=0,0,IMPRIMIR!$D$3)","v":0},0,{"$f":"IMPRIMIR!B510","v":0},{"$f":"IMPRIMIR!C510","v":0},{"$f":"IF(E511=0,0,IMPRIMIR!D510)","v":0},{"$f":"IF(E511=0,0,IMPRIMIR!E510)","v":0},0,0,0]
[null,{"$f":"IF(E512=0,0,IMPRIMIR!A511)","v":0},{"$f":"IF(E512=0,0,IMPRIMIR!$D$3)","v":0},0,{"$f":"IMPRIMIR!B511","v":0},{"$f":"IMPRIMIR!C511","v":0},{"$f":"IF(E512=0,0,IMPRIMIR!D511)","v":0},{"$f":"IF(E512=0,0,IMPRIMIR!E511)","v":0},0,0,0]
[null,{"$f":"IF(E513=0,0,IMPRIMIR!A512)","v":0},{"$f":"IF(E513=0,0,IMPRIMIR!$D$3)","v":0},0,{"$f":"IMPRIMIR!B512","v":0},{"$f":"IMPRIMIR!C512","v":0},{"$f":"IF(E513=0,0,IMPRIMIR!D512)","v":0},{"$f":"IF(E513=0,0,IMPRIMIR!E512)","v":0},0,0,0]
[null,{"$f":"IF(E514=0,0,IMPRIMIR!A513)","v":0},{"$f":"IF(E514=0,0,IMPRIMIR!$D$3)","v":0},0,{"$f":"IMPRIMIR!B513","v":0},{"$f":"IMPRIMIR!C513","v":0},{"$f":"IF(E514=0,0,IMPRIMIR!D513)","v":0},{"$f":"IF(E514=0,0,IMPRIMIR!E513)","v":0},0,0,0]
[null,{"$f":"IF(E515=0,0,IMPRIMIR!A514)","v":0},{"$f":"IF(E515=0,0,IMPRIMIR!$D$3)","v":0},0,{"$f":"IMPRIMIR!B514","v":0},{"$f":"IMPRIMIR!C514","v":0},{"$f":"IF(E515=0,0,IMPRIMIR!D514)","v":0},{"$f":"IF(E515=0,0,IMPRIMIR!E514)","v":0},0,0,0]
[null,{"$f":"IF(E516=0,0,IMPRIMIR!A515)","v":0},{"$f":"IF(E516=0,0,IMPRIMIR!$D$3)","v":0},0,{"$f":"IMPRIMIR!B515","v":0},{"$f":"IMPRIMIR!C515","v":0},{"$f":"IF(E516=0,0,IMPRIMIR!D515)","v":0},{"$f":"IF(E516=0,0,IMPRIMIR!E515)","v":0},0,0,0]
[null,{"$f":"IF(E517=0,0,IMPRIMIR!A516)","v":0},{"$f":"IF(E517=0,0,IMPRIMIR!$D$3)","v":0},0,{"$f":"IMPRIMIR!B516","v":0},{"$f":"IMPRIMIR!C516","v":0},{"$f":"IF(E517=0,0,IMPRIMIR!D516)","v":0},{"$f":"IF(E517=0,0,IMPRIMIR!E516)","v":0},0,0,0]
[null,{"$f":"IF(E518=0,0,IMPRIMIR!A517)","v":0},{"$f":"IF(E518=0,0,IMPRIMIR!$D$3)","v":0},0,{"$f":"IMPRIMIR!B517","v":0},{"$f":"IMPRIMIR!C517","v":0},{"$f":"IF(E518=0,0,IMPRIMIR!D517)","v":0},{"$f":"IF(E518=0,0,IMPRIMIR!E517)","v":0},0,0,0]
[null,{"$f":"IF(E519=0,0,IMPRIMIR!A518)","v":0},{"$f":"IF(E519=0,0,IMPRIMIR!$D$3)","v":0},0,{"$f":"IMPRIMIR!B518","v":0},{"$f":"IMPRIMIR!C518","v":0},{"$f":"IF(E519=0,0,IMPRIMIR!D518)","v":0},{"$f":"IF(E519=0,0,IMPRIMIR!E518)","v":0},0,0,0]
[null,{"$f":"IF(E520=0,0,IMPRIMIR!A519)","v":0},{"$f":"IF(E520=0,0,IMPRIMIR!$D$3)","v":0},0,{"$f":"IMPRIMIR!B519","v":0},{"$f":"IMPRIMIR!C519","v":0},{"$f":"IF(E520=0,0,IMPRIMIR!D519)","v":0},{"$f":"IF(E520=0,0,IMPRIMIR!E519)","v":0},0,0,0]
[null,{"$f":"IF(E521=0,0,IMPRIMIR!A520)","v":0},{"$f":"IF(E521=0,0,IMPRIMIR!$D$3)","v":0},{"$f":"IF(E521=\"0\",0,$G$2)","v":0},{"$f":"IMPRIMIR!B520","v":0},{"$f":"IMPRIMIR!C520","v":0},{"$f":"IF(E521=0,0,IMPRIMIR!D520)","v":0},{"$f":"IF(E521=0,0,IMPRIMIR!E520)","v":0},{"$f":"IF(E521=0,0,$G$2)","v":0},{"$f":"IF(E521=0,0,$G$4)","v":0},{"$f":"IF(E521=0,0,$G$3)","v":0}]
[null,{"$f":"IF(E522=0,0,IMPRIMIR!A521)","v":0},{"$f":"IF(E522=0,0,IMPRIMIR!$D$3)","v":0},0,{"$f":"IMPRIMIR!B521","v":0},{"$f":"IMPRIMIR!C521","v":0},{"$f":"IF(E522=0,0,IMPRIMIR!D521)","v":0},{"$f":"IF(E522=0,0,IMPRIMIR!E521)","v":0},0,0,0]
[null,{"$f":"IF(E523=0,0,IMPRIMIR!A522)","v":0},{"$f":"IF(E523=0,0,IMPRIMIR!$D$3)","v":0},0,{"$f":"IMPRIMIR!B522","v":0},{"$f":"IMPRIMIR!C522","v":0},{"$f":"IF(E523=0,0,IMPRIMIR!D522)","v":0},{"$f":"IF(E523=0,0,IMPRIMIR!E522)","v":0},0,0,0]
[null,{"$f":"IF(E524=0,0,IMPRIMIR!A523)","v":0},{"$f":"IF(E524=0,0,IMPRIMIR!$D$3)","v":0},0,{"$f":"IMPRIMIR!B523","v":0},{"$f":"IMPRIMIR!C523","v":0},{"$f":"IF(E524=0,0,IMPRIMIR!D523)","v":0},{"$f":"IF(E524=0,0,IMPRIMIR!E523)","v":0},0,0,0]
[null,{"$f":"IF(E525=0,0,IMPRIMIR!A524)","v":0},{"$f":"IF(E525=0,0,IMPRIMIR!$D$3)","v":0},0,{"$f":"IMPRIMIR!B524","v":0},{"$f":"IMPRIMIR!C524","v":0},{"$f":"IF(E525=0,0,IMPRIMIR!D524)","v":0},{"$f":"IF(E525=0,0,IMPRIMIR!E524)","v":0},0,0,0]
[null,{"$f":"IF(E526=0,0,IMPRIMIR!A525)","v":0},{"$f":"IF(E526=0,0,IMPRIMIR!$D$3)","v":0},0,{"$f":"IMPRIMIR!B525","v":0},{"$f":"IMPRIMIR!C525","v":0},{"$f":"IF(E526=0,0,IMPRIMIR!D525)","v":0},{"$f":"IF(E526=0,0,IMPRIMIR!E525)","v":0},0,0,0]
[null,{"$f":"IF(E527=0,0,IMPRIMIR!A526)","v":0},{"$f":"IF(E527=0,0,IMPRIMIR!$D$3)","v":0},0,{"$f":"IMPRIMIR!B526","v":0},{"$f":"IMPRIMIR!C526","v":0},{"$f":"IF(E527=0,0,IMPRIMIR!D526)","v":0},{"$f":"IF(E527=0,0,IMPRIMIR!E526)","v":0},0,0,0]
[null,{"$f":"IF(E528=0,0,IMPRIMIR!A527)","v":0},{"$f":"IF(E528=0,0,IMPRIMIR!$D$3)","v":0},0,{"$f":"IMPRIMIR!B527","v":0},{"$f":"IMPRIMIR!C527","v":0},{"$f":"IF(E528=0,0,IMPRIMIR!D527)","v":0},{"$f":"IF(E528=0,0,IMPRIMIR!E527)","v":0},0,0,0]
[null,{"$f":"IF(E529=0,0,IMPRIMIR!A528)","v":0},{"$f":"IF(E529=0,0,IMPRIMIR!$D$3)","v":0},0,{"$f":"IMPRIMIR!B528","v":0},{"$f":"IMPRIMIR!C528","v":0},{"$f":"IF(E529=0,0,IMPRIMIR!D528)","v":0},{"$f":"IF(E529=0,0,IMPRIMIR!E528)","v":0},0,0,0]
[null,{"$f":"IF(E530=0,0,IMPRIMIR!A529)","v":0},{"$f":"IF(E530=0,0,IMPRIMIR!$D$3)","v":0},0,{"$f":"IMPRIMIR!B529","v":0},{"$f":"IMPRIMIR!C529","v":0},{"$f":"IF(E530=0,0,IMPRIMIR!D529)","v":0},{"$f":"IF(E530=0,0,IMPRIMIR!E529)","v":0},0,0,0]
[null,{"$f":"IF(E531=0,0,IMPRIMIR!A530)","v":0},{"$f":"IF(E531=0,0,IMPRIMIR!$D$3)","v":0},0,{"$f":"IMPRIMIR!B530","v":0},{"$f":"IMPRIMIR!C530","v":0},{"$f":"IF(E531=0,0,IMPRIMIR!D530)","v":0},{"$f":"IF(E531=0,0,IMPRIMIR!E530)","v":0},0,0,0]
[null,{"$f":"IF(E532=0,0,IMPRIMIR!A531)","v":0},{"$f":"IF(E532=0,0,IMPRIMIR!$D$3)","v":0},0,{"$f":"IMPRIMIR!B531","v":0},{"$f":"IMPRIMIR!C531","v":0},{"$f":"IF(E532=0,0,IMPRIMIR!D531)","v":0},{"$f":"IF(E532=0,0,IMPRIMIR!E531)","v":0},0,0,0]
[null,{"$f":"IF(E533=0,0,IMPRIMIR!A532)","v":0},{"$f":"IF(E533=0,0,IMPRIMIR!$D$3)","v":0},0,{"$f":"IMPRIMIR!B532","v":0},{"$f":"IMPRIMIR!C532","v":0},{"$f":"IF(E533=0,0,IMPRIMIR!D532)","v":0},{"$f":"IF(E533=0,0,IMPRIMIR!E532)","v":0},0,0,0]
[null,{"$f":"IF(E534=0,0,IMPRIMIR!A533)","v":0},{"$f":"IF(E534=0,0,IMPRIMIR!$D$3)","v":0},0,{"$f":"IMPRIMIR!B533","v":0},{"$f":"IMPRIMIR!C533","v":0},{"$f":"IF(E534=0,0,IMPRIMIR!D533)","v":0},{"$f":"IF(E534=0,0,IMPRIMIR!E533)","v":0},0,0,0]
[null,{"$f":"IF(E535=0,0,IMPRIMIR!A534)","v":0},{"$f":"IF(E535=0,0,IMPRIMIR!$D$3)","v":0},0,{"$f":"IMPRIMIR!B534","v":0},{"$f":"IMPRIMIR!C534","v":0},{"$f":"IF(E535=0,0,IMPRIMIR!D534)","v":0},{"$f":"IF(E535=0,0,IMPRIMIR!E534)","v":0},0,0,0]
[null,{"$f":"IF(E536=0,0,IMPRIMIR!A535)","v":0},{"$f":"IF(E536=0,0,IMPRIMIR!$D$3)","v":0},0,{"$f":"IMPRIMIR!B535","v":0},{"$f":"IMPRIMIR!C535","v":0},{"$f":"IF(E536=0,0,IMPRIMIR!D535)","v":0},{"$f":"IF(E536=0,0,IMPRIMIR!E535)","v":0},0,0,0]
[null,{"$f":"IF(E537=0,0,IMPRIMIR!A536)","v":0},{"$f":"IF(E537=0,0,IMPRIMIR!$D$3)","v":0},0,{"$f":"IMPRIMIR!B536","v":0},{"$f":"IMPRIMIR!C536","v":0},{"$f":"IF(E537=0,0,IMPRIMIR!D536)","v":0},{"$f":"IF(E537=0,0,IMPRIMIR!E536)","v":0},0,0,0]
[null,{"$f":"IF(E538=0,0,IMPRIMIR!A537)","v":0},{"$f":"IF(E538=0,0,IMPRIMIR!$D$3)","v":0},0,{"$f":"IMPRIMIR!B537","v":0},{"$f":"IMPRIMIR!C537","v":0},{"$f":"IF(E538=0,0,IMPRIMIR!D537)","v":0},{"$f":"IF(E538=0,0,IMPRIMIR!E537)","v":0},0,0,0]
[null,{"$f":"IF(E539=0,0,IMPRIMIR!A538)","v":0},{"$f":"IF(E539=0,0,IMPRIMIR!$D$3)","v":0},0,{"$f":"IMPRIMIR!B538","v":0},{"$f":"IMPRIMIR!C538","v":0},{"$f":"IF(E539=0,0,IMPRIMIR!D538)","v":0},{"$f":"IF(E539=0,0,IMPRIMIR!E538)","v":0},0,0,0]
[null,{"$f":"IF(E540=0,0,IMPRIMIR!A539)","v":0},{"$f":"IF(E540=0,0,IMPRIMIR!$D$3)","v":0},0,{"$f":"IMPRIMIR!B539","v":0},{"$f":"IMPRIMIR!C539","v":0},{"$f":"IF(E540=0,0,IMPRIMIR!D539)","v":0},{"$f":"IF(E540=0,0,IMPRIMIR!E539)","v":0},0,0,0]
[null,{"$f":"IF(E541=0,0,IMPRIMIR!A540)","v":0},{"$f":"IF(E541=0,0,IMPRIMIR!$D$3)","v":0},0,{"$f":"IMPRIMIR!B540","v":0},{"$f":"IMPRIMIR!C540","v":0},{"$f":"IF(E541=0,0,IMPRIMIR!D540)","v":0},{"$f":"IF(E541=0,0,IMPRIMIR!E540)","v":0},0,0,0]
[null,{"$f":"IF(E542=0,0,IMPRIMIR!A541)","v":0},{"$f":"IF(E542=0,0,IMPRIMIR!$D$3)","v":0},0,{"$f":"IMPRIMIR!B541","v":0},{"$f":"IMPRIMIR!C541","v":0},{"$f":"IF(E542=0,0,IMPRIMIR!D541)","v":0},{"$f":"IF(E542=0,0,IMPRIMIR!E541)","v":0},0,0,0]
[null,{"$f":"IF(E543=0,0,IMPRIMIR!A542)","v":0},{"$f":"IF(E543=0,0,IMPRIMIR!$D$3)","v":0},0,{"$f":"IMPRIMIR!B542","v":0},{"$f":"IMPRIMIR!C542","v":0},{"$f":"IF(E543=0,0,IMPRIMIR!D542)","v":0},{"$f":"IF(E543=0,0,IMPRIMIR!E542)","v":0},0,0,0]
[null,{"$f":"IF(E544=0,0,IMPRIMIR!A543)","v":0},{"$f":"IF(E544=0,0,IMPRIMIR!$D$3)","v":0},0,{"$f":"IMPRIMIR!B543","v":0},{"$f":"IMPRIMIR!C543","v":0},{"$f":"IF(E544=0,0,IMPRIMIR!D543)","v":0},{"$f":"IF(E544=0,0,IMPRIMIR!E543)","v":0},0,0,0]
[null,{"$f":"IF(E545=0,0,IMPRIMIR!A544)","v":0},{"$f":"IF(E545=0,0,IMPRIMIR!$D$3)","v":0},0,{"$f":"IMPRIMIR!B544","v":0},{"$f":"IMPRIMIR!C544","v":0},{"$f":"IF(E545=0,0,IMPRIMIR!D544)","v":0},{"$f":"IF(E545=0,0,IMPRIMIR!E544)","v":0},0,0,0]
[null,{"$f":"IF(E546=0,0,IMPRIMIR!A545)","v":0},{"$f":"IF(E546=0,0,IMPRIMIR!$D$3)","v":0},0,{"$f":"IMPRIMIR!B545","v":0},{"$f":"IMPRIMIR!C545","v":0},{"$f":"IF(E546=0,0,IMPRIMIR!D545)","v":0},{"$f":"IF(E546=0,0,IMPRIMIR!E545)","v":0},0,0,0]
[null,{"$f":"IF(E547=0,0,IMPRIMIR!A546)","v":0},{"$f":"IF(E547=0,0,IMPRIMIR!$D$3)","v":0},0,{"$f":"IMPRIMIR!B546","v":0},{"$f":"IMPRIMIR!C546","v":0},{"$f":"IF(E547=0,0,IMPRIMIR!D546)","v":0},{"$f":"IF(E547=0,0,IMPRIMIR!E546)","v":0},0,0,0]
[null,{"$f":"IF(E548=0,0,IMPRIMIR!A547)","v":0},{"$f":"IF(E548=0,0,IMPRIMIR!$D$3)","v":0},0,{"$f":"IMPRIMIR!B547","v":0},{"$f":"IMPRIMIR!C547","v":0},{"$f":"IF(E548=0,0,IMPRIMIR!D547)","v":0},{"$f":"IF(E548=0,0,IMPRIMIR!E547)","v":0},0,0,0]
[null,{"$f":"IF(E549=0,0,IMPRIMIR!A548)","v":0},{"$f":"IF(E549=0,0,IMPRIMIR!$D$3)","v":0},0,{"$f":"IMPRIMIR!B548","v":0},{"$f":"IMPRIMIR!C548","v":0},{"$f":"IF(E549=0,0,IMPRIMIR!D548)","v":0},{"$f":"IF(E549=0,0,IMPRIMIR!E548)","v":0},0,0,0]
[null,{"$f":"IF(E550=0,0,IMPRIMIR!A549)","v":0},{"$f":"IF(E550=0,0,IMPRIMIR!$D$3)","v":0},0,{"$f":"IMPRIMIR!B549","v":0},{"$f":"IMPRIMIR!C549","v":0},{"$f":"IF(E550=0,0,IMPRIMIR!D549)","v":0},{"$f":"IF(E550=0,0,IMPRIMIR!E549)","v":0},0,0,0]
[null,{"$f":"IF(E551=0,0,IMPRIMIR!A550)","v":0},{"$f":"IF(E551=0,0,IMPRIMIR!$D$3)","v":0},0,{"$f":"IMPRIMIR!B550","v":0},{"$f":"IMPRIMIR!C550","v":0},{"$f":"IF(E551=0,0,IMPRIMIR!D550)","v":0},{"$f":"IF(E551=0,0,IMPRIMIR!E550)","v":0},0,0,0]
[null,{"$f":"IF(E552=0,0,IMPRIMIR!A551)","v":0},{"$f":"IF(E552=0,0,IMPRIMIR!$D$3)","v":0},0,{"$f":"IMPRIMIR!B551","v":0},{"$f":"IMPRIMIR!C551","v":0},{"$f":"IF(E552=0,0,IMPRIMIR!D551)","v":0},{"$f":"IF(E552=0,0,IMPRIMIR!E551)","v":0},0,0,0]
[null,{"$f":"IF(E553=0,0,IMPRIMIR!A552)","v":0},{"$f":"IF(E553=0,0,IMPRIMIR!$D$3)","v":0},0,{"$f":"IMPRIMIR!B552","v":0},{"$f":"IMPRIMIR!C552","v":0},{"$f":"IF(E553=0,0,IMPRIMIR!D552)","v":0},{"$f":"IF(E553=0,0,IMPRIMIR!E552)","v":0},0,0,0]
[null,{"$f":"IF(E554=0,0,IMPRIMIR!A553)","v":0},{"$f":"IF(E554=0,0,IMPRIMIR!$D$3)","v":0},0,{"$f":"IMPRIMIR!B553","v":0},{"$f":"IMPRIMIR!C553","v":0},{"$f":"IF(E554=0,0,IMPRIMIR!D553)","v":0},{"$f":"IF(E554=0,0,IMPRIMIR!E553)","v":0},0,0,0]
[null,{"$f":"IF(E555=0,0,IMPRIMIR!A554)","v":0},{"$f":"IF(E555=0,0,IMPRIMIR!$D$3)","v":0},0,{"$f":"IMPRIMIR!B554","v":0},{"$f":"IMPRIMIR!C554","v":0},{"$f":"IF(E555=0,0,IMPRIMIR!D554)","v":0},{"$f":"IF(E555=0,0,IMPRIMIR!E554)","v":0},0,0,0]
[null,{"$f":"IF(E556=0,0,IMPRIMIR!A555)","v":0},{"$f":"IF(E556=0,0,IMPRIMIR!$D$3)","v":0},0,{"$f":"IMPRIMIR!B555","v":0},{"$f":"IMPRIMIR!C555","v":0},{"$f":"IF(E556=0,0,IMPRIMIR!D555)","v":0},{"$f":"IF(E556=0,0,IMPRIMIR!E555)","v":0},0,0,0]
[null,{"$f":"IF(E557=0,0,IMPRIMIR!A556)","v":0},{"$f":"IF(E557=0,0,IMPRIMIR!$D$3)","v":0},0,{"$f":"IMPRIMIR!B556","v":0},{"$f":"IMPRIMIR!C556","v":0},{"$f":"IF(E557=0,0,IMPRIMIR!D556)","v":0},{"$f":"IF(E557=0,0,IMPRIMIR!E556)","v":0},0,0,0]
[null,{"$f":"IF(E558=0,0,IMPRIMIR!A557)","v":0},{"$f":"IF(E558=0,0,IMPRIMIR!$D$3)","v":0},0,{"$f":"IMPRIMIR!B557","v":0},{"$f":"IMPRIMIR!C557","v":0},{"$f":"IF(E558=0,0,IMPRIMIR!D557)","v":0},{"$f":"IF(E558=0,0,IMPRIMIR!E557)","v":0},0,0,0]
[null,{"$f":"IF(E559=0,0,IMPRIMIR!A558)","v":0},{"$f":"IF(E559=0,0,IMPRIMIR!$D$3)","v":0},0,{"$f":"IMPRIMIR!B558","v":0},{"$f":"IMPRIMIR!C558","v":0},{"$f":"IF(E559=0,0,IMPRIMIR!D558)","v":0},{"$f":"IF(E559=0,0,IMPRIMIR!E558)","v":0},0,0,0]
[null,{"$f":"IF(E560=0,0,IMPRIMIR!A559)","v":0},{"$f":"IF(E560=0,0,IMPRIMIR!$D$3)","v":0},0,{"$f":"IMPRIMIR!B559","v":0},{"$f":"IMPRIMIR!C559","v":0},{"$f":"IF(E560=0,0,IMPRIMIR!D559)","v":0},{"$f":"IF(E560=0,0,IMPRIMIR!E559)","v":0},0,0,0]
[null,{"$f":"IF(E561=0,0,IMPRIMIR!A560)","v":0},{"$f":"IF(E561=0,0,IMPRIMIR!$D$3)","v":0},0,{"$f":"IMPRIMIR!B560","v":0},{"$f":"IMPRIMIR!C560","v":0},{"$f":"IF(E561=0,0,IMPRIMIR!D560)","v":0},{"$f":"IF(E561=0,0,IMPRIMIR!E560)","v":0},0,0,0]
[null,{"$f":"IF(E562=0,0,IMPRIMIR!A561)","v":0},{"$f":"IF(E562=0,0,IMPRIMIR!$D$3)","v":0},0,{"$f":"IMPRIMIR!B561","v":0},{"$f":"IMPRIMIR!C561","v":0},{"$f":"IF(E562=0,0,IMPRIMIR!D561)","v":0},{"$f":"IF(E562=0,0,IMPRIMIR!E561)","v":0},0,0,0]
[null,{"$f":"IF(E563=0,0,IMPRIMIR!A562)","v":0},{"$f":"IF(E563=0,0,IMPRIMIR!$D$3)","v":0},0,{"$f":"IMPRIMIR!B562","v":0},{"$f":"IMPRIMIR!C562","v":0},{"$f":"IF(E563=0,0,IMPRIMIR!D562)","v":0},{"$f":"IF(E563=0,0,IMPRIMIR!E562)","v":0},0,0,0]
[null,{"$f":"IF(E564=0,0,IMPRIMIR!A563)","v":0},{"$f":"IF(E564=0,0,IMPRIMIR!$D$3)","v":0},0,{"$f":"IMPRIMIR!B563","v":0},{"$f":"IMPRIMIR!C563","v":0},{"$f":"IF(E564=0,0,IMPRIMIR!D563)","v":0},{"$f":"IF(E564=0,0,IMPRIMIR!E563)","v":0},0,0,0]
[null,{"$f":"IF(E565=0,0,IMPRIMIR!A564)","v":0},{"$f":"IF(E565=0,0,IMPRIMIR!$D$3)","v":0},0,{"$f":"IMPRIMIR!B564","v":0},{"$f":"IMPRIMIR!C564","v":0},{"$f":"IF(E565=0,0,IMPRIMIR!D564)","v":0},{"$f":"IF(E565=0,0,IMPRIMIR!E564)","v":0},0,0,0]
[null,{"$f":"IF(E566=0,0,IMPRIMIR!A565)","v":0},{"$f":"IF(E566=0,0,IMPRIMIR!$D$3)","v":0},0,{"$f":"IMPRIMIR!B565","v":0},{"$f":"IMPRIMIR!C565","v":0},{"$f":"IF(E566=0,0,IMPRIMIR!D565)","v":0},{"$f":"IF(E566=0,0,IMPRIMIR!E565)","v":0},0,0,0]
[null,{"$f":"IF(E567=0,0,IMPRIMIR!A566)","v":0},{"$f":"IF(E567=0,0,IMPRIMIR!$D$3)","v":0},0,{"$f":"IMPRIMIR!B566","v":0},{"$f":"IMPRIMIR!C566","v":0},{"$f":"IF(E567=0,0,IMPRIMIR!D566)","v":0},{"$f":"IF(E567=0,0,IMPRIMIR!E566)","v":0},0,0,0]
[null,{"$f":"IF(E568=0,0,IMPRIMIR!A567)","v":0},{"$f":"IF(E568=0,0,IMPRIMIR!$D$3)","v":0},0,{"$f":"IMPRIMIR!B567","v":0},{"$f":"IMPRIMIR!C567","v":0},{"$f":"IF(E568=0,0,IMPRIMIR!D567)","v":0},{"$f":"IF(E568=0,0,IMPRIMIR!E567)","v":0},0,0,0]
[null,{"$f":"IF(E569=0,0,IMPRIMIR!A568)","v":0},{"$f":"IF(E569=0,0,IMPRIMIR!$D$3)","v":0},0,{"$f":"IMPRIMIR!B568","v":0},{"$f":"IMPRIMIR!C568","v":0},{"$f":"IF(E569=0,0,IMPRIMIR!D568)","v":0},{"$f":"IF(E569=0,0,IMPRIMIR!E568)","v":0},0,0,0]
[null,{"$f":"IF(E570=0,0,IMPRIMIR!A569)","v":0},{"$f":"IF(E570=0,0,IMPRIMIR!$D$3)","v":0},0,{"$f":"IMPRIMIR!B569","v":0},{"$f":"IMPRIMIR!C569","v":0},{"$f":"IF(E570=0,0,IMPRIMIR!D569)","v":0},{"$f":"IF(E570=0,0,IMPRIMIR!E569)","v":0},0,0,0]
[null,{"$f":"IF(E571=0,0,IMPRIMIR!A570)","v":0},{"$f":"IF(E571=0,0,IMPRIMIR!$D$3)","v":0},0,{"$f":"IMPRIMIR!B570","v":0},{"$f":"IMPRIMIR!C570","v":0},{"$f":"IF(E571=0,0,IMPRIMIR!D570)","v":0},{"$f":"IF(E571=0,0,IMPRIMIR!E570)","v":0},0,0,0]
[null,{"$f":"IF(E572=0,0,IMPRIMIR!A571)","v":0},{"$f":"IF(E572=0,0,IMPRIMIR!$D$3)","v":0},0,{"$f":"IMPRIMIR!B571","v":0},{"$f":"IMPRIMIR!C571","v":0},{"$f":"IF(E572=0,0,IMPRIMIR!D571)","v":0},{"$f":"IF(E572=0,0,IMPRIMIR!E571)","v":0},0,0,0]
[null,{"$f":"IF(E573=0,0,IMPRIMIR!A572)","v":0},{"$f":"IF(E573=0,0,IMPRIMIR!$D$3)","v":0},0,{"$f":"IMPRIMIR!B572","v":0},{"$f":"IMPRIMIR!C572","v":0},{"$f":"IF(E573=0,0,IMPRIMIR!D572)","v":0},{"$f":"IF(E573=0,0,IMPRIMIR!E572)","v":0},0,0,0]
[null,{"$f":"IF(E574=0,0,IMPRIMIR!A573)","v":0},{"$f":"IF(E574=0,0,IMPRIMIR!$D$3)","v":0},0,{"$f":"IMPRIMIR!B573","v":0},{"$f":"IMPRIMIR!C573","v":0},{"$f":"IF(E574=0,0,IMPRIMIR!D573)","v":0},{"$f":"IF(E574=0,0,IMPRIMIR!E573)","v":0},0,0,0]
[null,{"$f":"IF(E575=0,0,IMPRIMIR!A574)","v":0},{"$f":"IF(E575=0,0,IMPRIMIR!$D$3)","v":0},0,{"$f":"IMPRIMIR!B574","v":0},{"$f":"IMPRIMIR!C574","v":0},{"$f":"IF(E575=0,0,IMPRIMIR!D574)","v":0},{"$f":"IF(E575=0,0,IMPRIMIR!E574)","v":0},0,0,0]
[null,{"$f":"IF(E576=0,0,IMPRIMIR!A575)","v":0},{"$f":"IF(E576=0,0,IMPRIMIR!$D$3)","v":0},0,{"$f":"IMPRIMIR!B575","v":0},{"$f":"IMPRIMIR!C575","v":0},{"$f":"IF(E576=0,0,IMPRIMIR!D575)","v":0},{"$f":"IF(E576=0,0,IMPRIMIR!E575)","v":0},0,0,0]
[null,{"$f":"IF(E577=0,0,IMPRIMIR!A576)","v":0},{"$f":"IF(E577=0,0,IMPRIMIR!$D$3)","v":0},0,{"$f":"IMPRIMIR!B576","v":0},{"$f":"IMPRIMIR!C576","v":0},{"$f":"IF(E577=0,0,IMPRIMIR!D576)","v":0},{"$f":"IF(E577=0,0,IMPRIMIR!E576)","v":0},0,0,0]
[null,{"$f":"IF(E578=0,0,IMPRIMIR!A577)","v":0},{"$f":"IF(E578=0,0,IMPRIMIR!$D$3)","v":0},0,{"$f":"IMPRIMIR!B577","v":0},{"$f":"IMPRIMIR!C577","v":0},{"$f":"IF(E578=0,0,IMPRIMIR!D577)","v":0},{"$f":"IF(E578=0,0,IMPRIMIR!E577)","v":0},0,0,0]
[null,{"$f":"IF(E579=0,0,IMPRIMIR!A578)","v":0},{"$f":"IF(E579=0,0,IMPRIMIR!$D$3)","v":0},0,{"$f":"IMPRIMIR!B578","v":0},{"$f":"IMPRIMIR!C578","v":0},{"$f":"IF(E579=0,0,IMPRIMIR!D578)","v":0},{"$f":"IF(E579=0,0,IMPRIMIR!E578)","v":0},0,0,0]
[null,{"$f":"IF(E580=0,0,IMPRIMIR!A579)","v":0},{"$f":"IF(E580=0,0,IMPRIMIR!$D$3)","v":0},0,{"$f":"IMPRIMIR!B579","v":0},{"$f":"IMPRIMIR!C579","v":0},{"$f":"IF(E580=0,0,IMPRIMIR!D579)","v":0},{"$f":"IF(E580=0,0,IMPRIMIR!E579)","v":0},0,0,0]
[null,{"$f":"IF(E581=0,0,IMPRIMIR!A580)","v":0},{"$f":"IF(E581=0,0,IMPRIMIR!$D$3)","v":0},0,{"$f":"IMPRIMIR!B580","v":0},{"$f":"IMPRIMIR!C580","v":0},{"$f":"IF(E581=0,0,IMPRIMIR!D580)","v":0},{"$f":"IF(E581=0,0,IMPRIMIR!E580)","v":0},0,0,0]
[null,{"$f":"IF(E582=0,0,IMPRIMIR!A581)","v":0},{"$f":"IF(E582=0,0,IMPRIMIR!$D$3)","v":0},0,{"$f":"IMPRIMIR!B581","v":0},{"$f":"IMPRIMIR!C581","v":0},{"$f":"IF(E582=0,0,IMPRIMIR!D581)","v":0},{"$f":"IF(E582=0,0,IMPRIMIR!E581)","v":0},0,0,0]
[null,{"$f":"IF(E583=0,0,IMPRIMIR!A582)","v":0},{"$f":"IF(E583=0,0,IMPRIMIR!$D$3)","v":0},0,{"$f":"IMPRIMIR!B582","v":0},{"$f":"IMPRIMIR!C582","v":0},{"$f":"IF(E583=0,0,IMPRIMIR!D582)","v":0},{"$f":"IF(E583=0,0,IMPRIMIR!E582)","v":0},0,0,0]
[null,{"$f":"IF(E584=0,0,IMPRIMIR!A583)","v":0},{"$f":"IF(E584=0,0,IMPRIMIR!$D$3)","v":0},0,{"$f":"IMPRIMIR!B583","v":0},{"$f":"IMPRIMIR!C583","v":0},{"$f":"IF(E584=0,0,IMPRIMIR!D583)","v":0},{"$f":"IF(E584=0,0,IMPRIMIR!E583)","v":0},0,0,0]
[null,{"$f":"IF(E585=0,0,IMPRIMIR!A584)","v":0},{"$f":"IF(E585=0,0,IMPRIMIR!$D$3)","v":0},{"$f":"IF(E585=\"0\",0,$G$2)","v":0},{"$f":"IMPRIMIR!B584","v":0},{"$f":"IMPRIMIR!C584","v":0},{"$f":"IF(E585=0,0,IMPRIMIR!D584)","v":0},{"$f":"IF(E585=0,0,IMPRIMIR!E584)","v":0},{"$f":"IF(E585=0,0,$G$2)","v":0},{"$f":"IF(E585=0,0,$G$4)","v":0},{"$f":"IF(E585=0,0,$G$3)","v":0}]
[null,{"$f":"IF(E586=0,0,IMPRIMIR!A585)","v":0},{"$f":"IF(E586=0,0,IMPRIMIR!$D$3)","v":0},0,{"$f":"IMPRIMIR!B585","v":0},{"$f":"IMPRIMIR!C585","v":0},{"$f":"IF(E586=0,0,IMPRIMIR!D585)","v":0},{"$f":"IF(E586=0,0,IMPRIMIR!E585)","v":0},0,0,0]
[null,{"$f":"IF(E587=0,0,IMPRIMIR!A586)","v":0},{"$f":"IF(E587=0,0,IMPRIMIR!$D$3)","v":0},0,{"$f":"IMPRIMIR!B586","v":0},{"$f":"IMPRIMIR!C586","v":0},{"$f":"IF(E587=0,0,IMPRIMIR!D586)","v":0},{"$f":"IF(E587=0,0,IMPRIMIR!E586)","v":0},0,0,0]
[null,{"$f":"IF(E588=0,0,IMPRIMIR!A587)","v":0},{"$f":"IF(E588=0,0,IMPRIMIR!$D$3)","v":0},0,{"$f":"IMPRIMIR!B587","v":0},{"$f":"IMPRIMIR!C587","v":0},{"$f":"IF(E588=0,0,IMPRIMIR!D587)","v":0},{"$f":"IF(E588=0,0,IMPRIMIR!E587)","v":0},0,0,0]
[null,{"$f":"IF(E589=0,0,IMPRIMIR!A588)","v":0},{"$f":"IF(E589=0,0,IMPRIMIR!$D$3)","v":0},0,{"$f":"IMPRIMIR!B588","v":0},{"$f":"IMPRIMIR!C588","v":0},{"$f":"IF(E589=0,0,IMPRIMIR!D588)","v":0},{"$f":"IF(E589=0,0,IMPRIMIR!E588)","v":0},0,0,0]
[null,{"$f":"IF(E590=0,0,IMPRIMIR!A589)","v":0},{"$f":"IF(E590=0,0,IMPRIMIR!$D$3)","v":0},0,{"$f":"IMPRIMIR!B589","v":0},{"$f":"IMPRIMIR!C589","v":0},{"$f":"IF(E590=0,0,IMPRIMIR!D589)","v":0},{"$f":"IF(E590=0,0,IMPRIMIR!E589)","v":0},0,0,0]
[null,{"$f":"IF(E591=0,0,IMPRIMIR!A590)","v":0},{"$f":"IF(E591=0,0,IMPRIMIR!$D$3)","v":0},0,{"$f":"IMPRIMIR!B590","v":0},{"$f":"IMPRIMIR!C590","v":0},{"$f":"IF(E591=0,0,IMPRIMIR!D590)","v":0},{"$f":"IF(E591=0,0,IMPRIMIR!E590)","v":0},0,0,0]
[null,{"$f":"IF(E592=0,0,IMPRIMIR!A591)","v":0},{"$f":"IF(E592=0,0,IMPRIMIR!$D$3)","v":0},0,{"$f":"IMPRIMIR!B591","v":0},{"$f":"IMPRIMIR!C591","v":0},{"$f":"IF(E592=0,0,IMPRIMIR!D591)","v":0},{"$f":"IF(E592=0,0,IMPRIMIR!E591)","v":0},0,0,0]
[null,{"$f":"IF(E593=0,0,IMPRIMIR!A592)","v":0},{"$f":"IF(E593=0,0,IMPRIMIR!$D$3)","v":0},0,{"$f":"IMPRIMIR!B592","v":0},{"$f":"IMPRIMIR!C592","v":0},{"$f":"IF(E593=0,0,IMPRIMIR!D592)","v":0},{"$f":"IF(E593=0,0,IMPRIMIR!E592)","v":0},0,0,0]
[null,{"$f":"IF(E594=0,0,IMPRIMIR!A593)","v":0},{"$f":"IF(E594=0,0,IMPRIMIR!$D$3)","v":0},0,{"$f":"IMPRIMIR!B593","v":0},{"$f":"IMPRIMIR!C593","v":0},{"$f":"IF(E594=0,0,IMPRIMIR!D593)","v":0},{"$f":"IF(E594=0,0,IMPRIMIR!E593)","v":0},0,0,0]
[null,{"$f":"IF(E595=0,0,IMPRIMIR!A594)","v":0},{"$f":"IF(E595=0,0,IMPRIMIR!$D$3)","v":0},0,{"$f":"IMPRIMIR!B594","v":0},{"$f":"IMPRIMIR!C594","v":0},{"$f":"IF(E595=0,0,IMPRIMIR!D594)","v":0},{"$f":"IF(E595=0,0,IMPRIMIR!E594)","v":0},0,0,0]
[null,{"$f":"IF(E596=0,0,IMPRIMIR!A595)","v":0},{"$f":"IF(E596=0,0,IMPRIMIR!$D$3)","v":0},0,{"$f":"IMPRIMIR!B595","v":0},{"$f":"IMPRIMIR!C595","v":0},{"$f":"IF(E596=0,0,IMPRIMIR!D595)","v":0},{"$f":"IF(E596=0,0,IMPRIMIR!E595)","v":0},0,0,0]
[null,{"$f":"IF(E597=0,0,IMPRIMIR!A596)","v":0},{"$f":"IF(E597=0,0,IMPRIMIR!$D$3)","v":0},0,{"$f":"IMPRIMIR!B596","v":0},{"$f":"IMPRIMIR!C596","v":0},{"$f":"IF(E597=0,0,IMPRIMIR!D596)","v":0},{"$f":"IF(E597=0,0,IMPRIMIR!E596)","v":0},0,0,0]
[null,{"$f":"IF(E598=0,0,IMPRIMIR!A597)","v":0},{"$f":"IF(E598=0,0,IMPRIMIR!$D$3)","v":0},0,{"$f":"IMPRIMIR!B597","v":0},{"$f":"IMPRIMIR!C597","v":0},{"$f":"IF(E598=0,0,IMPRIMIR!D597)","v":0},{"$f":"IF(E598=0,0,IMPRIMIR!E597)","v":0},0,0,0]
[null,{"$f":"IF(E599=0,0,IMPRIMIR!A598)","v":0},{"$f":"IF(E599=0,0,IMPRIMIR!$D$3)","v":0},0,{"$f":"IMPRIMIR!B598","v":0},{"$f":"IMPRIMIR!C598","v":0},{"$f":"IF(E599=0,0,IMPRIMIR!D598)","v":0},{"$f":"IF(E599=0,0,IMPRIMIR!E598)","v":0},0,0,0]
[null,{"$f":"IF(E600=0,0,IMPRIMIR!A599)","v":0},{"$f":"IF(E600=0,0,IMPRIMIR!$D$3)","v":0},0,{"$f":"IMPRIMIR!B599","v":0},{"$f":"IMPRIMIR!C599","v":0},{"$f":"IF(E600=0,0,IMPRIMIR!D599)","v":0},{"$f":"IF(E600=0,0,IMPRIMIR!E599)","v":0},0,0,0]
[null,{"$f":"IF(E601=0,0,IMPRIMIR!A600)","v":0},{"$f":"IF(E601=0,0,IMPRIMIR!$D$3)","v":0},0,{"$f":"IMPRIMIR!B600","v":0},{"$f":"IMPRIMIR!C600","v":0},{"$f":"IF(E601=0,0,IMPRIMIR!D600)","v":0},{"$f":"IF(E601=0,0,IMPRIMIR!E600)","v":0},0,0,0]
[null,{"$f":"IF(E602=0,0,IMPRIMIR!A601)","v":0},{"$f":"IF(E602=0,0,IMPRIMIR!$D$3)","v":0},0,{"$f":"IMPRIMIR!B601","v":0},{"$f":"IMPRIMIR!C601","v":0},{"$f":"IF(E602=0,0,IMPRIMIR!D601)","v":0},{"$f":"IF(E602=0,0,IMPRIMIR!E601)","v":0},0,0,0]
[null,{"$f":"IF(E603=0,0,IMPRIMIR!A602)","v":0},{"$f":"IF(E603=0,0,IMPRIMIR!$D$3)","v":0},0,{"$f":"IMPRIMIR!B602","v":0},{"$f":"IMPRIMIR!C602","v":0},{"$f":"IF(E603=0,0,IMPRIMIR!D602)","v":0},{"$f":"IF(E603=0,0,IMPRIMIR!E602)","v":0},0,0,0]
[null,{"$f":"IF(E604=0,0,IMPRIMIR!A603)","v":0},{"$f":"IF(E604=0,0,IMPRIMIR!$D$3)","v":0},0,{"$f":"IMPRIMIR!B603","v":0},{"$f":"IMPRIMIR!C603","v":0},{"$f":"IF(E604=0,0,IMPRIMIR!D603)","v":0},{"$f":"IF(E604=0,0,IMPRIMIR!E603)","v":0},0,0,0]
[null,{"$f":"IF(E605=0,0,IMPRIMIR!A604)","v":0},{"$f":"IF(E605=0,0,IMPRIMIR!$D$3)","v":0},0,{"$f":"IMPRIMIR!B604","v":0},{"$f":"IMPRIMIR!C604","v":0},{"$f":"IF(E605=0,0,IMPRIMIR!D604)","v":0},{"$f":"IF(E605=0,0,IMPRIMIR!E604)","v":0},0,0,0]
[null,{"$f":"IF(E606=0,0,IMPRIMIR!A605)","v":0},{"$f":"IF(E606=0,0,IMPRIMIR!$D$3)","v":0},0,{"$f":"IMPRIMIR!B605","v":0},{"$f":"IMPRIMIR!C605","v":0},{"$f":"IF(E606=0,0,IMPRIMIR!D605)","v":0},{"$f":"IF(E606=0,0,IMPRIMIR!E605)","v":0},0,0,0]
[null,{"$f":"IF(E607=0,0,IMPRIMIR!A606)","v":0},{"$f":"IF(E607=0,0,IMPRIMIR!$D$3)","v":0},0,{"$f":"IMPRIMIR!B606","v":0},{"$f":"IMPRIMIR!C606","v":0},{"$f":"IF(E607=0,0,IMPRIMIR!D606)","v":0},{"$f":"IF(E607=0,0,IMPRIMIR!E606)","v":0},0,0,0]
[null,{"$f":"IF(E608=0,0,IMPRIMIR!A607)","v":0},{"$f":"IF(E608=0,0,IMPRIMIR!$D$3)","v":0},0,{"$f":"IMPRIMIR!B607","v":0},{"$f":"IMPRIMIR!C607","v":0},{"$f":"IF(E608=0,0,IMPRIMIR!D607)","v":0},{"$f":"IF(E608=0,0,IMPRIMIR!E607)","v":0},0,0,0]
[null,{"$f":"IF(E609=0,0,IMPRIMIR!A608)","v":0},{"$f":"IF(E609=0,0,IMPRIMIR!$D$3)","v":0},0,{"$f":"IMPRIMIR!B608","v":0},{"$f":"IMPRIMIR!C608","v":0},{"$f":"IF(E609=0,0,IMPRIMIR!D608)","v":0},{"$f":"IF(E609=0,0,IMPRIMIR!E608)","v":0},0,0,0]
[null,{"$f":"IF(E610=0,0,IMPRIMIR!A609)","v":0},{"$f":"IF(E610=0,0,IMPRIMIR!$D$3)","v":0},0,{"$f":"IMPRIMIR!B609","v":0},{"$f":"IMPRIMIR!C609","v":0},{"$f":"IF(E610=0,0,IMPRIMIR!D609)","v":0},{"$f":"IF(E610=0,0,IMPRIMIR!E609)","v":0},0,0,0]
[null,{"$f":"IF(E611=0,0,IMPRIMIR!A610)","v":0},{"$f":"IF(E611=0,0,IMPRIMIR!$D$3)","v":0},0,{"$f":"IMPRIMIR!B610","v":0},{"$f":"IMPRIMIR!C610","v":0},{"$f":"IF(E611=0,0,IMPRIMIR!D610)","v":0},{"$f":"IF(E611=0,0,IMPRIMIR!E610)","v":0},0,0,0]
[null,{"$f":"IF(E612=0,0,IMPRIMIR!A611)","v":0},{"$f":"IF(E612=0,0,IMPRIMIR!$D$3)","v":0},0,{"$f":"IMPRIMIR!B611","v":0},{"$f":"IMPRIMIR!C611","v":0},{"$f":"IF(E612=0,0,IMPRIMIR!D611)","v":0},{"$f":"IF(E612=0,0,IMPRIMIR!E611)","v":0},0,0,0]
[null,{"$f":"IF(E613=0,0,IMPRIMIR!A612)","v":0},{"$f":"IF(E613=0,0,IMPRIMIR!$D$3)","v":0},0,{"$f":"IMPRIMIR!B612","v":0},{"$f":"IMPRIMIR!C612","v":0},{"$f":"IF(E613=0,0,IMPRIMIR!D612)","v":0},{"$f":"IF(E613=0,0,IMPRIMIR!E612)","v":0},0,0,0]
[null,{"$f":"IF(E614=0,0,IMPRIMIR!A613)","v":0},{"$f":"IF(E614=0,0,IMPRIMIR!$D$3)","v":0},0,{"$f":"IMPRIMIR!B613","v":0},{"$f":"IMPRIMIR!C613","v":0},{"$f":"IF(E614=0,0,IMPRIMIR!D613)","v":0},{"$f":"IF(E614=0,0,IMPRIMIR!E613)","v":0},0,0,0]
[null,{"$f":"IF(E615=0,0,IMPRIMIR!A614)","v":0},{"$f":"IF(E615=0,0,IMPRIMIR!$D$3)","v":0},0,{"$f":"IMPRIMIR!B614","v":0},{"$f":"IMPRIMIR!C614","v":0},{"$f":"IF(E615=0,0,IMPRIMIR!D614)","v":0},{"$f":"IF(E615=0,0,IMPRIMIR!E614)","v":0},0,0,0]
[null,{"$f":"IF(E616=0,0,IMPRIMIR!A615)","v":0},{"$f":"IF(E616=0,0,IMPRIMIR!$D$3)","v":0},0,{"$f":"IMPRIMIR!B615","v":0},{"$f":"IMPRIMIR!C615","v":0},{"$f":"IF(E616=0,0,IMPRIMIR!D615)","v":0},{"$f":"IF(E616=0,0,IMPRIMIR!E615)","v":0},0,0,0]
[null,{"$f":"IF(E617=0,0,IMPRIMIR!A616)","v":0},{"$f":"IF(E617=0,0,IMPRIMIR!$D$3)","v":0},0,{"$f":"IMPRIMIR!B616","v":0},{"$f":"IMPRIMIR!C616","v":0},{"$f":"IF(E617=0,0,IMPRIMIR!D616)","v":0},{"$f":"IF(E617=0,0,IMPRIMIR!E616)","v":0},0,0,0]
[null,{"$f":"IF(E618=0,0,IMPRIMIR!A617)","v":0},{"$f":"IF(E618=0,0,IMPRIMIR!$D$3)","v":0},0,{"$f":"IMPRIMIR!B617","v":0},{"$f":"IMPRIMIR!C617","v":0},{"$f":"IF(E618=0,0,IMPRIMIR!D617)","v":0},{"$f":"IF(E618=0,0,IMPRIMIR!E617)","v":0},0,0,0]
[null,{"$f":"IF(E619=0,0,IMPRIMIR!A618)","v":0},{"$f":"IF(E619=0,0,IMPRIMIR!$D$3)","v":0},0,{"$f":"IMPRIMIR!B618","v":0},{"$f":"IMPRIMIR!C618","v":0},{"$f":"IF(E619=0,0,IMPRIMIR!D618)","v":0},{"$f":"IF(E619=0,0,IMPRIMIR!E618)","v":0},0,0,0]
[null,{"$f":"IF(E620=0,0,IMPRIMIR!A619)","v":0},{"$f":"IF(E620=0,0,IMPRIMIR!$D$3)","v":0},0,{"$f":"IMPRIMIR!B619","v":0},{"$f":"IMPRIMIR!C619","v":0},{"$f":"IF(E620=0,0,IMPRIMIR!D619)","v":0},{"$f":"IF(E620=0,0,IMPRIMIR!E619)","v":0},0,0,0]
[null,{"$f":"IF(E621=0,0,IMPRIMIR!A620)","v":0},{"$f":"IF(E621=0,0,IMPRIMIR!$D$3)","v":0},0,{"$f":"IMPRIMIR!B620","v":0},{"$f":"IMPRIMIR!C620","v":0},{"$f":"IF(E621=0,0,IMPRIMIR!D620)","v":0},{"$f":"IF(E621=0,0,IMPRIMIR!E620)","v":0},0,0,0]
[null,{"$f":"IF(E622=0,0,IMPRIMIR!A621)","v":0},{"$f":"IF(E622=0,0,IMPRIMIR!$D$3)","v":0},0,{"$f":"IMPRIMIR!B621","v":0},{"$f":"IMPRIMIR!C621","v":0},{"$f":"IF(E622=0,0,IMPRIMIR!D621)","v":0},{"$f":"IF(E622=0,0,IMPRIMIR!E621)","v":0},0,0,0]
[null,{"$f":"IF(E623=0,0,IMPRIMIR!A622)","v":0},{"$f":"IF(E623=0,0,IMPRIMIR!$D$3)","v":0},0,{"$f":"IMPRIMIR!B622","v":0},{"$f":"IMPRIMIR!C622","v":0},{"$f":"IF(E623=0,0,IMPRIMIR!D622)","v":0},{"$f":"IF(E623=0,0,IMPRIMIR!E622)","v":0},0,0,0]
[null,{"$f":"IF(E624=0,0,IMPRIMIR!A623)","v":0},{"$f":"IF(E624=0,0,IMPRIMIR!$D$3)","v":0},0,{"$f":"IMPRIMIR!B623","v":0},{"$f":"IMPRIMIR!C623","v":0},{"$f":"IF(E624=0,0,IMPRIMIR!D623)","v":0},{"$f":"IF(E624=0,0,IMPRIMIR!E623)","v":0},0,0,0]
[null,{"$f":"IF(E625=0,0,IMPRIMIR!A624)","v":0},{"$f":"IF(E625=0,0,IMPRIMIR!$D$3)","v":0},0,{"$f":"IMPRIMIR!B624","v":0},{"$f":"IMPRIMIR!C624","v":0},{"$f":"IF(E625=0,0,IMPRIMIR!D624)","v":0},{"$f":"IF(E625=0,0,IMPRIMIR!E624)","v":0},0,0,0]
[null,{"$f":"IF(E626=0,0,IMPRIMIR!A625)","v":0},{"$f":"IF(E626=0,0,IMPRIMIR!$D$3)","v":0},0,{"$f":"IMPRIMIR!B625","v":0},{"$f":"IMPRIMIR!C625","v":0},{"$f":"IF(E626=0,0,IMPRIMIR!D625)","v":0},{"$f":"IF(E626=0,0,IMPRIMIR!E625)","v":0},0,0,0]
[null,{"$f":"IF(E627=0,0,IMPRIMIR!A626)","v":0},{"$f":"IF(E627=0,0,IMPRIMIR!$D$3)","v":0},0,{"$f":"IMPRIMIR!B626","v":0},{"$f":"IMPRIMIR!C626","v":0},{"$f":"IF(E627=0,0,IMPRIMIR!D626)","v":0},{"$f":"IF(E627=0,0,IMPRIMIR!E626)","v":0},0,0,0]
[null,{"$f":"IF(E628=0,0,IMPRIMIR!A627)","v":0},{"$f":"IF(E628=0,0,IMPRIMIR!$D$3)","v":0},0,{"$f":"IMPRIMIR!B627","v":0},{"$f":"IMPRIMIR!C627","v":0},{"$f":"IF(E628=0,0,IMPRIMIR!D627)","v":0},{"$f":"IF(E628=0,0,IMPRIMIR!E627)","v":0},0,0,0]
[null,{"$f":"IF(E629=0,0,IMPRIMIR!A628)","v":0},{"$f":"IF(E629=0,0,IMPRIMIR!$D$3)","v":0},0,{"$f":"IMPRIMIR!B628","v":0},{"$f":"IMPRIMIR!C628","v":0},{"$f":"IF(E629=0,0,IMPRIMIR!D628)","v":0},{"$f":"IF(E629=0,0,IMPRIMIR!E628)","v":0},0,0,0]
[null,{"$f":"IF(E630=0,0,IMPRIMIR!A629)","v":0},{"$f":"IF(E630=0,0,IMPRIMIR!$D$3)","v":0},0,{"$f":"IMPRIMIR!B629","v":0},{"$f":"IMPRIMIR!C629","v":0},{"$f":"IF(E630=0,0,IMPRIMIR!D629)","v":0},{"$f":"IF(E630=0,0,IMPRIMIR!E629)","v":0},0,0,0]
[null,{"$f":"IF(E631=0,0,IMPRIMIR!A630)","v":0},{"$f":"IF(E631=0,0,IMPRIMIR!$D$3)","v":0},0,{"$f":"IMPRIMIR!B630","v":0},{"$f":"IMPRIMIR!C630","v":0},{"$f":"IF(E631=0,0,IMPRIMIR!D630)","v":0},{"$f":"IF(E631=0,0,IMPRIMIR!E630)","v":0},0,0,0]
[null,{"$f":"IF(E632=0,0,IMPRIMIR!A631)","v":0},{"$f":"IF(E632=0,0,IMPRIMIR!$D$3)","v":0},0,{"$f":"IMPRIMIR!B631","v":0},{"$f":"IMPRIMIR!C631","v":0},{"$f":"IF(E632=0,0,IMPRIMIR!D631)","v":0},{"$f":"IF(E632=0,0,IMPRIMIR!E631)","v":0},0,0,0]
[null,{"$f":"IF(E633=0,0,IMPRIMIR!A632)","v":0},{"$f":"IF(E633=0,0,IMPRIMIR!$D$3)","v":0},0,{"$f":"IMPRIMIR!B632","v":0},{"$f":"IMPRIMIR!C632","v":0},{"$f":"IF(E633=0,0,IMPRIMIR!D632)","v":0},{"$f":"IF(E633=0,0,IMPRIMIR!E632)","v":0},0,0,0]
[null,{"$f":"IF(E634=0,0,IMPRIMIR!A633)","v":0},{"$f":"IF(E634=0,0,IMPRIMIR!$D$3)","v":0},0,{"$f":"IMPRIMIR!B633","v":0},{"$f":"IMPRIMIR!C633","v":0},{"$f":"IF(E634=0,0,IMPRIMIR!D633)","v":0},{"$f":"IF(E634=0,0,IMPRIMIR!E633)","v":0},0,0,0]
[null,{"$f":"IF(E635=0,0,IMPRIMIR!A634)","v":0},{"$f":"IF(E635=0,0,IMPRIMIR!$D$3)","v":0},0,{"$f":"IMPRIMIR!B634","v":0},{"$f":"IMPRIMIR!C634","v":0},{"$f":"IF(E635=0,0,IMPRIMIR!D634)","v":0},{"$f":"IF(E635=0,0,IMPRIMIR!E634)","v":0},0,0,0]
[null,{"$f":"IF(E636=0,0,IMPRIMIR!A635)","v":0},{"$f":"IF(E636=0,0,IMPRIMIR!$D$3)","v":0},0,{"$f":"IMPRIMIR!B635","v":0},{"$f":"IMPRIMIR!C635","v":0},{"$f":"IF(E636=0,0,IMPRIMIR!D635)","v":0},{"$f":"IF(E636=0,0,IMPRIMIR!E635)","v":0},0,0,0]
[null,{"$f":"IF(E637=0,0,IMPRIMIR!A636)","v":0},{"$f":"IF(E637=0,0,IMPRIMIR!$D$3)","v":0},0,{"$f":"IMPRIMIR!B636","v":0},{"$f":"IMPRIMIR!C636","v":0},{"$f":"IF(E637=0,0,IMPRIMIR!D636)","v":0},{"$f":"IF(E637=0,0,IMPRIMIR!E636)","v":0},0,0,0]
[null,{"$f":"IF(E638=0,0,IMPRIMIR!A637)","v":0},{"$f":"IF(E638=0,0,IMPRIMIR!$D$3)","v":0},0,{"$f":"IMPRIMIR!B637","v":0},{"$f":"IMPRIMIR!C637","v":0},{"$f":"IF(E638=0,0,IMPRIMIR!D637)","v":0},{"$f":"IF(E638=0,0,IMPRIMIR!E637)","v":0},0,0,0]
[null,{"$f":"IF(E639=0,0,IMPRIMIR!A638)","v":0},{"$f":"IF(E639=0,0,IMPRIMIR!$D$3)","v":0},0,{"$f":"IMPRIMIR!B638","v":0},{"$f":"IMPRIMIR!C638","v":0},{"$f":"IF(E639=0,0,IMPRIMIR!D638)","v":0},{"$f":"IF(E639=0,0,IMPRIMIR!E638)","v":0},0,0,0]
[null,{"$f":"IF(E640=0,0,IMPRIMIR!A639)","v":0},{"$f":"IF(E640=0,0,IMPRIMIR!$D$3)","v":0},0,{"$f":"IMPRIMIR!B639","v":0},{"$f":"IMPRIMIR!C639","v":0},{"$f":"IF(E640=0,0,IMPRIMIR!D639)","v":0},{"$f":"IF(E640=0,0,IMPRIMIR!E639)","v":0},0,0,0]
[null,{"$f":"IF(E641=0,0,IMPRIMIR!A640)","v":0},{"$f":"IF(E641=0,0,IMPRIMIR!$D$3)","v":0},0,{"$f":"IMPRIMIR!B640","v":0},{"$f":"IMPRIMIR!C640","v":0},{"$f":"IF(E641=0,0,IMPRIMIR!D640)","v":0},{"$f":"IF(E641=0,0,IMPRIMIR!E640)","v":0},0,0,0]
[null,{"$f":"IF(E642=0,0,IMPRIMIR!A641)","v":0},{"$f":"IF(E642=0,0,IMPRIMIR!$D$3)","v":0},0,{"$f":"IMPRIMIR!B641","v":0},{"$f":"IMPRIMIR!C641","v":0},{"$f":"IF(E642=0,0,IMPRIMIR!D641)","v":0},{"$f":"IF(E642=0,0,IMPRIMIR!E641)","v":0},0,0,0]
[null,{"$f":"IF(E643=0,0,IMPRIMIR!A642)","v":0},{"$f":"IF(E643=0,0,IMPRIMIR!$D$3)","v":0},0,{"$f":"IMPRIMIR!B642","v":0},{"$f":"IMPRIMIR!C642","v":0},{"$f":"IF(E643=0,0,IMPRIMIR!D642)","v":0},{"$f":"IF(E643=0,0,IMPRIMIR!E642)","v":0},0,0,0]
[null,{"$f":"IF(E644=0,0,IMPRIMIR!A643)","v":0},{"$f":"IF(E644=0,0,IMPRIMIR!$D$3)","v":0},0,{"$f":"IMPRIMIR!B643","v":0},{"$f":"IMPRIMIR!C643","v":0},{"$f":"IF(E644=0,0,IMPRIMIR!D643)","v":0},{"$f":"IF(E644=0,0,IMPRIMIR!E643)","v":0},0,0,0]
[null,{"$f":"IF(E645=0,0,IMPRIMIR!A644)","v":0},{"$f":"IF(E645=0,0,IMPRIMIR!$D$3)","v":0},0,{"$f":"IMPRIMIR!B644","v":0},{"$f":"IMPRIMIR!C644","v":0},{"$f":"IF(E645=0,0,IMPRIMIR!D644)","v":0},{"$f":"IF(E645=0,0,IMPRIMIR!E644)","v":0},0,0,0]
[null,{"$f":"IF(E646=0,0,IMPRIMIR!A645)","v":0},{"$f":"IF(E646=0,0,IMPRIMIR!$D$3)","v":0},0,{"$f":"IMPRIMIR!B645","v":0},{"$f":"IMPRIMIR!C645","v":0},{"$f":"IF(E646=0,0,IMPRIMIR!D645)","v":0},{"$f":"IF(E646=0,0,IMPRIMIR!E645)","v":0},0,0,0]
[null,{"$f":"IF(E647=0,0,IMPRIMIR!A646)","v":0},{"$f":"IF(E647=0,0,IMPRIMIR!$D$3)","v":0},0,{"$f":"IMPRIMIR!B646","v":0},{"$f":"IMPRIMIR!C646","v":0},{"$f":"IF(E647=0,0,IMPRIMIR!D646)","v":0},{"$f":"IF(E647=0,0,IMPRIMIR!E646)","v":0},0,0,0]
[null,{"$f":"IF(E648=0,0,IMPRIMIR!A647)","v":0},{"$f":"IF(E648=0,0,IMPRIMIR!$D$3)","v":0},0,{"$f":"IMPRIMIR!B647","v":0},{"$f":"IMPRIMIR!C647","v":0},{"$f":"IF(E648=0,0,IMPRIMIR!D647)","v":0},{"$f":"IF(E648=0,0,IMPRIMIR!E647)","v":0},0,0,0]
[null,{"$f":"IF(E649=0,0,IMPRIMIR!A648)","v":0},{"$f":"IF(E649=0,0,IMPRIMIR!$D$3)","v":0},{"$f":"IF(E649=\"0\",0,$G$2)","v":0},{"$f":"IMPRIMIR!B648","v":0},{"$f":"IMPRIMIR!C648","v":0},{"$f":"IF(E649=0,0,IMPRIMIR!D648)","v":0},{"$f":"IF(E649=0,0,IMPRIMIR!E648)","v":0},{"$f":"IF(E649=0,0,$G$2)","v":0},{"$f":"IF(E649=0,0,$G$4)","v":0},{"$f":"IF(E649=0,0,$G$3)","v":0}]
[null,{"$f":"IF(E650=0,0,IMPRIMIR!A649)","v":0},{"$f":"IF(E650=0,0,IMPRIMIR!$D$3)","v":0},0,{"$f":"IMPRIMIR!B649","v":0},{"$f":"IMPRIMIR!C649","v":0},{"$f":"IF(E650=0,0,IMPRIMIR!D649)","v":0},{"$f":"IF(E650=0,0,IMPRIMIR!E649)","v":0},0,0,0]
[null,{"$f":"IF(E651=0,0,IMPRIMIR!A650)","v":0},{"$f":"IF(E651=0,0,IMPRIMIR!$D$3)","v":0},0,{"$f":"IMPRIMIR!B650","v":0},{"$f":"IMPRIMIR!C650","v":0},{"$f":"IF(E651=0,0,IMPRIMIR!D650)","v":0},{"$f":"IF(E651=0,0,IMPRIMIR!E650)","v":0},0,0,0]
[null,{"$f":"IF(E652=0,0,IMPRIMIR!A651)","v":0},{"$f":"IF(E652=0,0,IMPRIMIR!$D$3)","v":0},0,{"$f":"IMPRIMIR!B651","v":0},{"$f":"IMPRIMIR!C651","v":0},{"$f":"IF(E652=0,0,IMPRIMIR!D651)","v":0},{"$f":"IF(E652=0,0,IMPRIMIR!E651)","v":0},0,0,0]
[null,{"$f":"IF(E653=0,0,IMPRIMIR!A652)","v":0},{"$f":"IF(E653=0,0,IMPRIMIR!$D$3)","v":0},0,{"$f":"IMPRIMIR!B652","v":0},{"$f":"IMPRIMIR!C652","v":0},{"$f":"IF(E653=0,0,IMPRIMIR!D652)","v":0},{"$f":"IF(E653=0,0,IMPRIMIR!E652)","v":0},0,0,0]
[null,{"$f":"IF(E654=0,0,IMPRIMIR!A653)","v":0},{"$f":"IF(E654=0,0,IMPRIMIR!$D$3)","v":0},0,{"$f":"IMPRIMIR!B653","v":0},{"$f":"IMPRIMIR!C653","v":0},{"$f":"IF(E654=0,0,IMPRIMIR!D653)","v":0},{"$f":"IF(E654=0,0,IMPRIMIR!E653)","v":0},0,0,0]
[null,{"$f":"IF(E655=0,0,IMPRIMIR!A654)","v":0},{"$f":"IF(E655=0,0,IMPRIMIR!$D$3)","v":0},0,{"$f":"IMPRIMIR!B654","v":0},{"$f":"IMPRIMIR!C654","v":0},{"$f":"IF(E655=0,0,IMPRIMIR!D654)","v":0},{"$f":"IF(E655=0,0,IMPRIMIR!E654)","v":0},0,0,0]
[null,{"$f":"IF(E656=0,0,IMPRIMIR!A655)","v":0},{"$f":"IF(E656=0,0,IMPRIMIR!$D$3)","v":0},0,{"$f":"IMPRIMIR!B655","v":0},{"$f":"IMPRIMIR!C655","v":0},{"$f":"IF(E656=0,0,IMPRIMIR!D655)","v":0},{"$f":"IF(E656=0,0,IMPRIMIR!E655)","v":0},0,0,0]
[null,{"$f":"IF(E657=0,0,IMPRIMIR!A656)","v":0},{"$f":"IF(E657=0,0,IMPRIMIR!$D$3)","v":0},0,{"$f":"IMPRIMIR!B656","v":0},{"$f":"IMPRIMIR!C656","v":0},{"$f":"IF(E657=0,0,IMPRIMIR!D656)","v":0},{"$f":"IF(E657=0,0,IMPRIMIR!E656)","v":0},0,0,0]
[null,{"$f":"IF(E658=0,0,IMPRIMIR!A657)","v":0},{"$f":"IF(E658=0,0,IMPRIMIR!$D$3)","v":0},0,{"$f":"IMPRIMIR!B657","v":0},{"$f":"IMPRIMIR!C657","v":0},{"$f":"IF(E658=0,0,IMPRIMIR!D657)","v":0},{"$f":"IF(E658=0,0,IMPRIMIR!E657)","v":0},0,0,0]
[null,{"$f":"IF(E659=0,0,IMPRIMIR!A658)","v":0},{"$f":"IF(E659=0,0,IMPRIMIR!$D$3)","v":0},0,{"$f":"IMPRIMIR!B658","v":0},{"$f":"IMPRIMIR!C658","v":0},{"$f":"IF(E659=0,0,IMPRIMIR!D658)","v":0},{"$f":"IF(E659=0,0,IMPRIMIR!E658)","v":0},0,0,0]
[null,{"$f":"IF(E660=0,0,IMPRIMIR!A659)","v":0},{"$f":"IF(E660=0,0,IMPRIMIR!$D$3)","v":0},0,{"$f":"IMPRIMIR!B659","v":0},{"$f":"IMPRIMIR!C659","v":0},{"$f":"IF(E660=0,0,IMPRIMIR!D659)","v":0},{"$f":"IF(E660=0,0,IMPRIMIR!E659)","v":0},0,0,0]
[null,{"$f":"IF(E661=0,0,IMPRIMIR!A660)","v":0},{"$f":"IF(E661=0,0,IMPRIMIR!$D$3)","v":0},0,{"$f":"IMPRIMIR!B660","v":0},{"$f":"IMPRIMIR!C660","v":0},{"$f":"IF(E661=0,0,IMPRIMIR!D660)","v":0},{"$f":"IF(E661=0,0,IMPRIMIR!E660)","v":0},0,0,0]
[null,{"$f":"IF(E662=0,0,IMPRIMIR!A661)","v":0},{"$f":"IF(E662=0,0,IMPRIMIR!$D$3)","v":0},0,{"$f":"IMPRIMIR!B661","v":0},{"$f":"IMPRIMIR!C661","v":0},{"$f":"IF(E662=0,0,IMPRIMIR!D661)","v":0},{"$f":"IF(E662=0,0,IMPRIMIR!E661)","v":0},0,0,0]
[null,{"$f":"IF(E663=0,0,IMPRIMIR!A662)","v":0},{"$f":"IF(E663=0,0,IMPRIMIR!$D$3)","v":0},0,{"$f":"IMPRIMIR!B662","v":0},{"$f":"IMPRIMIR!C662","v":0},{"$f":"IF(E663=0,0,IMPRIMIR!D662)","v":0},{"$f":"IF(E663=0,0,IMPRIMIR!E662)","v":0},0,0,0]
[null,{"$f":"IF(E664=0,0,IMPRIMIR!A663)","v":0},{"$f":"IF(E664=0,0,IMPRIMIR!$D$3)","v":0},0,{"$f":"IMPRIMIR!B663","v":0},{"$f":"IMPRIMIR!C663","v":0},{"$f":"IF(E664=0,0,IMPRIMIR!D663)","v":0},{"$f":"IF(E664=0,0,IMPRIMIR!E663)","v":0},0,0,0]
[null,{"$f":"IF(E665=0,0,IMPRIMIR!A664)","v":0},{"$f":"IF(E665=0,0,IMPRIMIR!$D$3)","v":0},0,{"$f":"IMPRIMIR!B664","v":0},{"$f":"IMPRIMIR!C664","v":0},{"$f":"IF(E665=0,0,IMPRIMIR!D664)","v":0},{"$f":"IF(E665=0,0,IMPRIMIR!E664)","v":0},0,0,0]
[null,{"$f":"IF(E666=0,0,IMPRIMIR!A665)","v":0},{"$f":"IF(E666=0,0,IMPRIMIR!$D$3)","v":0},0,{"$f":"IMPRIMIR!B665","v":0},{"$f":"IMPRIMIR!C665","v":0},{"$f":"IF(E666=0,0,IMPRIMIR!D665)","v":0},{"$f":"IF(E666=0,0,IMPRIMIR!E665)","v":0},0,0,0]
[null,{"$f":"IF(E667=0,0,IMPRIMIR!A666)","v":0},{"$f":"IF(E667=0,0,IMPRIMIR!$D$3)","v":0},0,{"$f":"IMPRIMIR!B666","v":0},{"$f":"IMPRIMIR!C666","v":0},{"$f":"IF(E667=0,0,IMPRIMIR!D666)","v":0},{"$f":"IF(E667=0,0,IMPRIMIR!E666)","v":0},0,0,0]
[null,{"$f":"IF(E668=0,0,IMPRIMIR!A667)","v":0},{"$f":"IF(E668=0,0,IMPRIMIR!$D$3)","v":0},0,{"$f":"IMPRIMIR!B667","v":0},{"$f":"IMPRIMIR!C667","v":0},{"$f":"IF(E668=0,0,IMPRIMIR!D667)","v":0},{"$f":"IF(E668=0,0,IMPRIMIR!E667)","v":0},0,0,0]
[null,{"$f":"IF(E669=0,0,IMPRIMIR!A668)","v":0},{"$f":"IF(E669=0,0,IMPRIMIR!$D$3)","v":0},0,{"$f":"IMPRIMIR!B668","v":0},{"$f":"IMPRIMIR!C668","v":0},{"$f":"IF(E669=0,0,IMPRIMIR!D668)","v":0},{"$f":"IF(E669=0,0,IMPRIMIR!E668)","v":0},0,0,0]
[null,{"$f":"IF(E670=0,0,IMPRIMIR!A669)","v":0},{"$f":"IF(E670=0,0,IMPRIMIR!$D$3)","v":0},0,{"$f":"IMPRIMIR!B669","v":0},{"$f":"IMPRIMIR!C669","v":0},{"$f":"IF(E670=0,0,IMPRIMIR!D669)","v":0},{"$f":"IF(E670=0,0,IMPRIMIR!E669)","v":0},0,0,0]
[null,{"$f":"IF(E671=0,0,IMPRIMIR!A670)","v":0},{"$f":"IF(E671=0,0,IMPRIMIR!$D$3)","v":0},0,{"$f":"IMPRIMIR!B670","v":0},{"$f":"IMPRIMIR!C670","v":0},{"$f":"IF(E671=0,0,IMPRIMIR!D670)","v":0},{"$f":"IF(E671=0,0,IMPRIMIR!E670)","v":0},0,0,0]
[null,{"$f":"IF(E672=0,0,IMPRIMIR!A671)","v":0},{"$f":"IF(E672=0,0,IMPRIMIR!$D$3)","v":0},0,{"$f":"IMPRIMIR!B671","v":0},{"$f":"IMPRIMIR!C671","v":0},{"$f":"IF(E672=0,0,IMPRIMIR!D671)","v":0},{"$f":"IF(E672=0,0,IMPRIMIR!E671)","v":0},0,0,0]
[null,{"$f":"IF(E673=0,0,IMPRIMIR!A672)","v":0},{"$f":"IF(E673=0,0,IMPRIMIR!$D$3)","v":0},0,{"$f":"IMPRIMIR!B672","v":0},{"$f":"IMPRIMIR!C672","v":0},{"$f":"IF(E673=0,0,IMPRIMIR!D672)","v":0},{"$f":"IF(E673=0,0,IMPRIMIR!E672)","v":0},0,0,0]
[null,{"$f":"IF(E674=0,0,IMPRIMIR!A673)","v":0},{"$f":"IF(E674=0,0,IMPRIMIR!$D$3)","v":0},0,{"$f":"IMPRIMIR!B673","v":0},{"$f":"IMPRIMIR!C673","v":0},{"$f":"IF(E674=0,0,IMPRIMIR!D673)","v":0},{"$f":"IF(E674=0,0,IMPRIMIR!E673)","v":0},0,0,0]
[null,{"$f":"IF(E675=0,0,IMPRIMIR!A674)","v":0},{"$f":"IF(E675=0,0,IMPRIMIR!$D$3)","v":0},0,{"$f":"IMPRIMIR!B674","v":0},{"$f":"IMPRIMIR!C674","v":0},{"$f":"IF(E675=0,0,IMPRIMIR!D674)","v":0},{"$f":"IF(E675=0,0,IMPRIMIR!E674)","v":0},0,0,0]
[null,{"$f":"IF(E676=0,0,IMPRIMIR!A675)","v":0},{"$f":"IF(E676=0,0,IMPRIMIR!$D$3)","v":0},0,{"$f":"IMPRIMIR!B675","v":0},{"$f":"IMPRIMIR!C675","v":0},{"$f":"IF(E676=0,0,IMPRIMIR!D675)","v":0},{"$f":"IF(E676=0,0,IMPRIMIR!E675)","v":0},0,0,0]
[null,{"$f":"IF(E677=0,0,IMPRIMIR!A676)","v":0},{"$f":"IF(E677=0,0,IMPRIMIR!$D$3)","v":0},0,{"$f":"IMPRIMIR!B676","v":0},{"$f":"IMPRIMIR!C676","v":0},{"$f":"IF(E677=0,0,IMPRIMIR!D676)","v":0},{"$f":"IF(E677=0,0,IMPRIMIR!E676)","v":0},0,0,0]
[null,{"$f":"IF(E678=0,0,IMPRIMIR!A677)","v":0},{"$f":"IF(E678=0,0,IMPRIMIR!$D$3)","v":0},0,{"$f":"IMPRIMIR!B677","v":0},{"$f":"IMPRIMIR!C677","v":0},{"$f":"IF(E678=0,0,IMPRIMIR!D677)","v":0},{"$f":"IF(E678=0,0,IMPRIMIR!E677)","v":0},0,0,0]
[null,{"$f":"IF(E679=0,0,IMPRIMIR!A678)","v":0},{"$f":"IF(E679=0,0,IMPRIMIR!$D$3)","v":0},0,{"$f":"IMPRIMIR!B678","v":0},{"$f":"IMPRIMIR!C678","v":0},{"$f":"IF(E679=0,0,IMPRIMIR!D678)","v":0},{"$f":"IF(E679=0,0,IMPRIMIR!E678)","v":0},0,0,0]
[null,{"$f":"IF(E680=0,0,IMPRIMIR!A679)","v":0},{"$f":"IF(E680=0,0,IMPRIMIR!$D$3)","v":0},0,{"$f":"IMPRIMIR!B679","v":0},{"$f":"IMPRIMIR!C679","v":0},{"$f":"IF(E680=0,0,IMPRIMIR!D679)","v":0},{"$f":"IF(E680=0,0,IMPRIMIR!E679)","v":0},0,0,0]
[null,{"$f":"IF(E681=0,0,IMPRIMIR!A680)","v":0},{"$f":"IF(E681=0,0,IMPRIMIR!$D$3)","v":0},0,{"$f":"IMPRIMIR!B680","v":0},{"$f":"IMPRIMIR!C680","v":0},{"$f":"IF(E681=0,0,IMPRIMIR!D680)","v":0},{"$f":"IF(E681=0,0,IMPRIMIR!E680)","v":0},0,0,0]
[null,{"$f":"IF(E682=0,0,IMPRIMIR!A681)","v":0},{"$f":"IF(E682=0,0,IMPRIMIR!$D$3)","v":0},0,{"$f":"IMPRIMIR!B681","v":0},{"$f":"IMPRIMIR!C681","v":0},{"$f":"IF(E682=0,0,IMPRIMIR!D681)","v":0},{"$f":"IF(E682=0,0,IMPRIMIR!E681)","v":0},0,0,0]
[null,{"$f":"IF(E683=0,0,IMPRIMIR!A682)","v":0},{"$f":"IF(E683=0,0,IMPRIMIR!$D$3)","v":0},0,{"$f":"IMPRIMIR!B682","v":0},{"$f":"IMPRIMIR!C682","v":0},{"$f":"IF(E683=0,0,IMPRIMIR!D682)","v":0},{"$f":"IF(E683=0,0,IMPRIMIR!E682)","v":0},0,0,0]
[null,{"$f":"IF(E684=0,0,IMPRIMIR!A683)","v":0},{"$f":"IF(E684=0,0,IMPRIMIR!$D$3)","v":0},0,{"$f":"IMPRIMIR!B683","v":0},{"$f":"IMPRIMIR!C683","v":0},{"$f":"IF(E684=0,0,IMPRIMIR!D683)","v":0},{"$f":"IF(E684=0,0,IMPRIMIR!E683)","v":0},0,0,0]
[null,{"$f":"IF(E685=0,0,IMPRIMIR!A684)","v":0},{"$f":"IF(E685=0,0,IMPRIMIR!$D$3)","v":0},0,{"$f":"IMPRIMIR!B684","v":0},{"$f":"IMPRIMIR!C684","v":0},{"$f":"IF(E685=0,0,IMPRIMIR!D684)","v":0},{"$f":"IF(E685=0,0,IMPRIMIR!E684)","v":0},0,0,0]
[null,{"$f":"IF(E686=0,0,IMPRIMIR!A685)","v":0},{"$f":"IF(E686=0,0,IMPRIMIR!$D$3)","v":0},0,{"$f":"IMPRIMIR!B685","v":0},{"$f":"IMPRIMIR!C685","v":0},{"$f":"IF(E686=0,0,IMPRIMIR!D685)","v":0},{"$f":"IF(E686=0,0,IMPRIMIR!E685)","v":0},0,0,0]
[null,{"$f":"IF(E687=0,0,IMPRIMIR!A686)","v":0},{"$f":"IF(E687=0,0,IMPRIMIR!$D$3)","v":0},0,{"$f":"IMPRIMIR!B686","v":0},{"$f":"IMPRIMIR!C686","v":0},{"$f":"IF(E687=0,0,IMPRIMIR!D686)","v":0},{"$f":"IF(E687=0,0,IMPRIMIR!E686)","v":0},0,0,0]
[null,{"$f":"IF(E688=0,0,IMPRIMIR!A687)","v":0},{"$f":"IF(E688=0,0,IMPRIMIR!$D$3)","v":0},0,{"$f":"IMPRIMIR!B687","v":0},{"$f":"IMPRIMIR!C687","v":0},{"$f":"IF(E688=0,0,IMPRIMIR!D687)","v":0},{"$f":"IF(E688=0,0,IMPRIMIR!E687)","v":0},0,0,0]
[null,{"$f":"IF(E689=0,0,IMPRIMIR!A688)","v":0},{"$f":"IF(E689=0,0,IMPRIMIR!$D$3)","v":0},0,{"$f":"IMPRIMIR!B688","v":0},{"$f":"IMPRIMIR!C688","v":0},{"$f":"IF(E689=0,0,IMPRIMIR!D688)","v":0},{"$f":"IF(E689=0,0,IMPRIMIR!E688)","v":0},0,0,0]
[null,{"$f":"IF(E690=0,0,IMPRIMIR!A689)","v":0},{"$f":"IF(E690=0,0,IMPRIMIR!$D$3)","v":0},0,{"$f":"IMPRIMIR!B689","v":0},{"$f":"IMPRIMIR!C689","v":0},{"$f":"IF(E690=0,0,IMPRIMIR!D689)","v":0},{"$f":"IF(E690=0,0,IMPRIMIR!E689)","v":0},0,0,0]
[null,{"$f":"IF(E691=0,0,IMPRIMIR!A690)","v":0},{"$f":"IF(E691=0,0,IMPRIMIR!$D$3)","v":0},0,{"$f":"IMPRIMIR!B690","v":0},{"$f":"IMPRIMIR!C690","v":0},{"$f":"IF(E691=0,0,IMPRIMIR!D690)","v":0},{"$f":"IF(E691=0,0,IMPRIMIR!E690)","v":0},0,0,0]
[null,{"$f":"IF(E692=0,0,IMPRIMIR!A691)","v":0},{"$f":"IF(E692=0,0,IMPRIMIR!$D$3)","v":0},0,{"$f":"IMPRIMIR!B691","v":0},{"$f":"IMPRIMIR!C691","v":0},{"$f":"IF(E692=0,0,IMPRIMIR!D691)","v":0},{"$f":"IF(E692=0,0,IMPRIMIR!E691)","v":0},0,0,0]
[null,{"$f":"IF(E693=0,0,IMPRIMIR!A692)","v":0},{"$f":"IF(E693=0,0,IMPRIMIR!$D$3)","v":0},0,{"$f":"IMPRIMIR!B692","v":0},{"$f":"IMPRIMIR!C692","v":0},{"$f":"IF(E693=0,0,IMPRIMIR!D692)","v":0},{"$f":"IF(E693=0,0,IMPRIMIR!E692)","v":0},0,0,0]
[null,{"$f":"IF(E694=0,0,IMPRIMIR!A693)","v":0},{"$f":"IF(E694=0,0,IMPRIMIR!$D$3)","v":0},0,{"$f":"IMPRIMIR!B693","v":0},{"$f":"IMPRIMIR!C693","v":0},{"$f":"IF(E694=0,0,IMPRIMIR!D693)","v":0},{"$f":"IF(E694=0,0,IMPRIMIR!E693)","v":0},0,0,0]
[null,{"$f":"IF(E695=0,0,IMPRIMIR!A694)","v":0},{"$f":"IF(E695=0,0,IMPRIMIR!$D$3)","v":0},0,{"$f":"IMPRIMIR!B694","v":0},{"$f":"IMPRIMIR!C694","v":0},{"$f":"IF(E695=0,0,IMPRIMIR!D694)","v":0},{"$f":"IF(E695=0,0,IMPRIMIR!E694)","v":0},0,0,0]
[null,{"$f":"IF(E696=0,0,IMPRIMIR!A695)","v":0},{"$f":"IF(E696=0,0,IMPRIMIR!$D$3)","v":0},0,{"$f":"IMPRIMIR!B695","v":0},{"$f":"IMPRIMIR!C695","v":0},{"$f":"IF(E696=0,0,IMPRIMIR!D695)","v":0},{"$f":"IF(E696=0,0,IMPRIMIR!E695)","v":0},0,0,0]
[null,{"$f":"IF(E697=0,0,IMPRIMIR!A696)","v":0},{"$f":"IF(E697=0,0,IMPRIMIR!$D$3)","v":0},0,{"$f":"IMPRIMIR!B696","v":0},{"$f":"IMPRIMIR!C696","v":0},{"$f":"IF(E697=0,0,IMPRIMIR!D696)","v":0},{"$f":"IF(E697=0,0,IMPRIMIR!E696)","v":0},0,0,0]
[null,{"$f":"IF(E698=0,0,IMPRIMIR!A697)","v":0},{"$f":"IF(E698=0,0,IMPRIMIR!$D$3)","v":0},0,{"$f":"IMPRIMIR!B697","v":0},{"$f":"IMPRIMIR!C697","v":0},{"$f":"IF(E698=0,0,IMPRIMIR!D697)","v":0},{"$f":"IF(E698=0,0,IMPRIMIR!E697)","v":0},0,0,0]
[null,{"$f":"IF(E699=0,0,IMPRIMIR!A698)","v":0},{"$f":"IF(E699=0,0,IMPRIMIR!$D$3)","v":0},0,{"$f":"IMPRIMIR!B698","v":0},{"$f":"IMPRIMIR!C698","v":0},{"$f":"IF(E699=0,0,IMPRIMIR!D698)","v":0},{"$f":"IF(E699=0,0,IMPRIMIR!E698)","v":0},0,0,0]
[null,{"$f":"IF(E700=0,0,IMPRIMIR!A699)","v":0},{"$f":"IF(E700=0,0,IMPRIMIR!$D$3)","v":0},0,{"$f":"IMPRIMIR!B699","v":0},{"$f":"IMPRIMIR!C699","v":0},{"$f":"IF(E700=0,0,IMPRIMIR!D699)","v":0},{"$f":"IF(E700=0,0,IMPRIMIR!E699)","v":0},0,0,0]
[null,{"$f":"IF(E701=0,0,IMPRIMIR!A700)","v":0},{"$f":"IF(E701=0,0,IMPRIMIR!$D$3)","v":0},0,{"$f":"IMPRIMIR!B700","v":0},{"$f":"IMPRIMIR!C700","v":0},{"$f":"IF(E701=0,0,IMPRIMIR!D700)","v":0},{"$f":"IF(E701=0,0,IMPRIMIR!E700)","v":0},0,0,0]
[null,{"$f":"IF(E702=0,0,IMPRIMIR!A701)","v":0},{"$f":"IF(E702=0,0,IMPRIMIR!$D$3)","v":0},0,{"$f":"IMPRIMIR!B701","v":0},{"$f":"IMPRIMIR!C701","v":0},{"$f":"IF(E702=0,0,IMPRIMIR!D701)","v":0},{"$f":"IF(E702=0,0,IMPRIMIR!E701)","v":0},0,0,0]
[null,{"$f":"IF(E703=0,0,IMPRIMIR!A702)","v":0},{"$f":"IF(E703=0,0,IMPRIMIR!$D$3)","v":0},0,{"$f":"IMPRIMIR!B702","v":0},{"$f":"IMPRIMIR!C702","v":0},{"$f":"IF(E703=0,0,IMPRIMIR!D702)","v":0},{"$f":"IF(E703=0,0,IMPRIMIR!E702)","v":0},0,0,0]
[null,{"$f":"IF(E704=0,0,IMPRIMIR!A703)","v":0},{"$f":"IF(E704=0,0,IMPRIMIR!$D$3)","v":0},0,{"$f":"IMPRIMIR!B703","v":0},{"$f":"IMPRIMIR!C703","v":0},{"$f":"IF(E704=0,0,IMPRIMIR!D703)","v":0},{"$f":"IF(E704=0,0,IMPRIMIR!E703)","v":0},0,0,0]
[null,{"$f":"IF(E705=0,0,IMPRIMIR!A704)","v":0},{"$f":"IF(E705=0,0,IMPRIMIR!$D$3)","v":0},0,{"$f":"IMPRIMIR!B704","v":0},{"$f":"IMPRIMIR!C704","v":0},{"$f":"IF(E705=0,0,IMPRIMIR!D704)","v":0},{"$f":"IF(E705=0,0,IMPRIMIR!E704)","v":0},0,0,0]
[null,{"$f":"IF(E706=0,0,IMPRIMIR!A705)","v":0},{"$f":"IF(E706=0,0,IMPRIMIR!$D$3)","v":0},0,{"$f":"IMPRIMIR!B705","v":0},{"$f":"IMPRIMIR!C705","v":0},{"$f":"IF(E706=0,0,IMPRIMIR!D705)","v":0},{"$f":"IF(E706=0,0,IMPRIMIR!E705)","v":0},0,0,0]
[null,{"$f":"IF(E707=0,0,IMPRIMIR!A706)","v":0},{"$f":"IF(E707=0,0,IMPRIMIR!$D$3)","v":0},0,{"$f":"IMPRIMIR!B706","v":0},{"$f":"IMPRIMIR!C706","v":0},{"$f":"IF(E707=0,0,IMPRIMIR!D706)","v":0},{"$f":"IF(E707=0,0,IMPRIMIR!E706)","v":0},0,0,0]
[null,{"$f":"IF(E708=0,0,IMPRIMIR!A707)","v":0},{"$f":"IF(E708=0,0,IMPRIMIR!$D$3)","v":0},0,{"$f":"IMPRIMIR!B707","v":0},{"$f":"IMPRIMIR!C707","v":0},{"$f":"IF(E708=0,0,IMPRIMIR!D707)","v":0},{"$f":"IF(E708=0,0,IMPRIMIR!E707)","v":0},0,0,0]
[null,{"$f":"IF(E709=0,0,IMPRIMIR!A708)","v":0},{"$f":"IF(E709=0,0,IMPRIMIR!$D$3)","v":0},0,{"$f":"IMPRIMIR!B708","v":0},{"$f":"IMPRIMIR!C708","v":0},{"$f":"IF(E709=0,0,IMPRIMIR!D708)","v":0},{"$f":"IF(E709=0,0,IMPRIMIR!E708)","v":0},0,0,0]
[null,{"$f":"IF(E710=0,0,IMPRIMIR!A709)","v":0},{"$f":"IF(E710=0,0,IMPRIMIR!$D$3)","v":0},0,{"$f":"IMPRIMIR!B709","v":0},{"$f":"IMPRIMIR!C709","v":0},{"$f":"IF(E710=0,0,IMPRIMIR!D709)","v":0},{"$f":"IF(E710=0,0,IMPRIMIR!E709)","v":0},0,0,0]
[null,{"$f":"IF(E711=0,0,IMPRIMIR!A710)","v":0},{"$f":"IF(E711=0,0,IMPRIMIR!$D$3)","v":0},0,{"$f":"IMPRIMIR!B710","v":0},{"$f":"IMPRIMIR!C710","v":0},{"$f":"IF(E711=0,0,IMPRIMIR!D710)","v":0},{"$f":"IF(E711=0,0,IMPRIMIR!E710)","v":0},0,0,0]
[null,{"$f":"IF(E712=0,0,IMPRIMIR!A711)","v":0},{"$f":"IF(E712=0,0,IMPRIMIR!$D$3)","v":0},0,{"$f":"IMPRIMIR!B711","v":0},{"$f":"IMPRIMIR!C711","v":0},{"$f":"IF(E712=0,0,IMPRIMIR!D711)","v":0},{"$f":"IF(E712=0,0,IMPRIMIR!E711)","v":0},0,0,0]
[null,{"$f":"IF(E713=0,0,IMPRIMIR!A712)","v":0},{"$f":"IF(E713=0,0,IMPRIMIR!$D$3)","v":0},{"$f":"IF(E713=\"0\",0,$G$2)","v":0},{"$f":"IMPRIMIR!B712","v":0},{"$f":"IMPRIMIR!C712","v":0},{"$f":"IF(E713=0,0,IMPRIMIR!D712)","v":0},{"$f":"IF(E713=0,0,IMPRIMIR!E712)","v":0},{"$f":"IF(E713=0,0,$G$2)","v":0},{"$f":"IF(E713=0,0,$G$4)","v":0},{"$f":"IF(E713=0,0,$G$3)","v":0}]
[null,{"$f":"IF(E714=0,0,IMPRIMIR!A713)","v":0},{"$f":"IF(E714=0,0,IMPRIMIR!$D$3)","v":0},0,{"$f":"IMPRIMIR!B713","v":0},{"$f":"IMPRIMIR!C713","v":0},{"$f":"IF(E714=0,0,IMPRIMIR!D713)","v":0},{"$f":"IF(E714=0,0,IMPRIMIR!E713)","v":0},0,0,0]
[null,{"$f":"IF(E715=0,0,IMPRIMIR!A714)","v":0},{"$f":"IF(E715=0,0,IMPRIMIR!$D$3)","v":0},0,{"$f":"IMPRIMIR!B714","v":0},{"$f":"IMPRIMIR!C714","v":0},{"$f":"IF(E715=0,0,IMPRIMIR!D714)","v":0},{"$f":"IF(E715=0,0,IMPRIMIR!E714)","v":0},0,0,0]
[null,{"$f":"IF(E716=0,0,IMPRIMIR!A715)","v":0},{"$f":"IF(E716=0,0,IMPRIMIR!$D$3)","v":0},0,{"$f":"IMPRIMIR!B715","v":0},{"$f":"IMPRIMIR!C715","v":0},{"$f":"IF(E716=0,0,IMPRIMIR!D715)","v":0},{"$f":"IF(E716=0,0,IMPRIMIR!E715)","v":0},0,0,0]
[null,{"$f":"IF(E717=0,0,IMPRIMIR!A716)","v":0},{"$f":"IF(E717=0,0,IMPRIMIR!$D$3)","v":0},0,{"$f":"IMPRIMIR!B716","v":0},{"$f":"IMPRIMIR!C716","v":0},{"$f":"IF(E717=0,0,IMPRIMIR!D716)","v":0},{"$f":"IF(E717=0,0,IMPRIMIR!E716)","v":0},0,0,0]
[null,{"$f":"IF(E718=0,0,IMPRIMIR!A717)","v":0},{"$f":"IF(E718=0,0,IMPRIMIR!$D$3)","v":0},0,{"$f":"IMPRIMIR!B717","v":0},{"$f":"IMPRIMIR!C717","v":0},{"$f":"IF(E718=0,0,IMPRIMIR!D717)","v":0},{"$f":"IF(E718=0,0,IMPRIMIR!E717)","v":0},0,0,0]
[null,{"$f":"IF(E719=0,0,IMPRIMIR!A718)","v":0},{"$f":"IF(E719=0,0,IMPRIMIR!$D$3)","v":0},0,{"$f":"IMPRIMIR!B718","v":0},{"$f":"IMPRIMIR!C718","v":0},{"$f":"IF(E719=0,0,IMPRIMIR!D718)","v":0},{"$f":"IF(E719=0,0,IMPRIMIR!E718)","v":0},0,0,0]
[null,{"$f":"IF(E720=0,0,IMPRIMIR!A719)","v":0},{"$f":"IF(E720=0,0,IMPRIMIR!$D$3)","v":0},0,{"$f":"IMPRIMIR!B719","v":0},{"$f":"IMPRIMIR!C719","v":0},{"$f":"IF(E720=0,0,IMPRIMIR!D719)","v":0},{"$f":"IF(E720=0,0,IMPRIMIR!E719)","v":0},0,0,0]
[null,{"$f":"IF(E721=0,0,IMPRIMIR!A720)","v":0},{"$f":"IF(E721=0,0,IMPRIMIR!$D$3)","v":0},0,{"$f":"IMPRIMIR!B720","v":0},{"$f":"IMPRIMIR!C720","v":0},{"$f":"IF(E721=0,0,IMPRIMIR!D720)","v":0},{"$f":"IF(E721=0,0,IMPRIMIR!E720)","v":0},0,0,0]
[null,{"$f":"IF(E722=0,0,IMPRIMIR!A721)","v":0},{"$f":"IF(E722=0,0,IMPRIMIR!$D$3)","v":0},0,{"$f":"IMPRIMIR!B721","v":0},{"$f":"IMPRIMIR!C721","v":0},{"$f":"IF(E722=0,0,IMPRIMIR!D721)","v":0},{"$f":"IF(E722=0,0,IMPRIMIR!E721)","v":0},0,0,0]
[null,{"$f":"IF(E723=0,0,IMPRIMIR!A722)","v":0},{"$f":"IF(E723=0,0,IMPRIMIR!$D$3)","v":0},0,{"$f":"IMPRIMIR!B722","v":0},{"$f":"IMPRIMIR!C722","v":0},{"$f":"IF(E723=0,0,IMPRIMIR!D722)","v":0},{"$f":"IF(E723=0,0,IMPRIMIR!E722)","v":0},0,0,0]
[null,{"$f":"IF(E724=0,0,IMPRIMIR!A723)","v":0},{"$f":"IF(E724=0,0,IMPRIMIR!$D$3)","v":0},0,{"$f":"IMPRIMIR!B723","v":0},{"$f":"IMPRIMIR!C723","v":0},{"$f":"IF(E724=0,0,IMPRIMIR!D723)","v":0},{"$f":"IF(E724=0,0,IMPRIMIR!E723)","v":0},0,0,0]
[null,{"$f":"IF(E725=0,0,IMPRIMIR!A724)","v":0},{"$f":"IF(E725=0,0,IMPRIMIR!$D$3)","v":0},0,{"$f":"IMPRIMIR!B724","v":0},{"$f":"IMPRIMIR!C724","v":0},{"$f":"IF(E725=0,0,IMPRIMIR!D724)","v":0},{"$f":"IF(E725=0,0,IMPRIMIR!E724)","v":0},0,0,0]
[null,{"$f":"IF(E726=0,0,IMPRIMIR!A725)","v":0},{"$f":"IF(E726=0,0,IMPRIMIR!$D$3)","v":0},0,{"$f":"IMPRIMIR!B725","v":0},{"$f":"IMPRIMIR!C725","v":0},{"$f":"IF(E726=0,0,IMPRIMIR!D725)","v":0},{"$f":"IF(E726=0,0,IMPRIMIR!E725)","v":0},0,0,0]
[null,{"$f":"IF(E727=0,0,IMPRIMIR!A726)","v":0},{"$f":"IF(E727=0,0,IMPRIMIR!$D$3)","v":0},0,{"$f":"IMPRIMIR!B726","v":0},{"$f":"IMPRIMIR!C726","v":0},{"$f":"IF(E727=0,0,IMPRIMIR!D726)","v":0},{"$f":"IF(E727=0,0,IMPRIMIR!E726)","v":0},0,0,0]
[null,{"$f":"IF(E728=0,0,IMPRIMIR!A727)","v":0},{"$f":"IF(E728=0,0,IMPRIMIR!$D$3)","v":0},0,{"$f":"IMPRIMIR!B727","v":0},{"$f":"IMPRIMIR!C727","v":0},{"$f":"IF(E728=0,0,IMPRIMIR!D727)","v":0},{"$f":"IF(E728=0,0,IMPRIMIR!E727)","v":0},0,0,0]
[null,{"$f":"IF(E729=0,0,IMPRIMIR!A728)","v":0},{"$f":"IF(E729=0,0,IMPRIMIR!$D$3)","v":0},0,{"$f":"IMPRIMIR!B728","v":0},{"$f":"IMPRIMIR!C728","v":0},{"$f":"IF(E729=0,0,IMPRIMIR!D728)","v":0},{"$f":"IF(E729=0,0,IMPRIMIR!E728)","v":0},0,0,0]
[null,{"$f":"IF(E730=0,0,IMPRIMIR!A729)","v":0},{"$f":"IF(E730=0,0,IMPRIMIR!$D$3)","v":0},0,{"$f":"IMPRIMIR!B729","v":0},{"$f":"IMPRIMIR!C729","v":0},{"$f":"IF(E730=0,0,IMPRIMIR!D729)","v":0},{"$f":"IF(E730=0,0,IMPRIMIR!E729)","v":0},0,0,0]
[null,{"$f":"IF(E731=0,0,IMPRIMIR!A730)","v":0},{"$f":"IF(E731=0,0,IMPRIMIR!$D$3)","v":0},0,{"$f":"IMPRIMIR!B730","v":0},{"$f":"IMPRIMIR!C730","v":0},{"$f":"IF(E731=0,0,IMPRIMIR!D730)","v":0},{"$f":"IF(E731=0,0,IMPRIMIR!E730)","v":0},0,0,0]
[null,{"$f":"IF(E732=0,0,IMPRIMIR!A731)","v":0},{"$f":"IF(E732=0,0,IMPRIMIR!$D$3)","v":0},0,{"$f":"IMPRIMIR!B731","v":0},{"$f":"IMPRIMIR!C731","v":0},{"$f":"IF(E732=0,0,IMPRIMIR!D731)","v":0},{"$f":"IF(E732=0,0,IMPRIMIR!E731)","v":0},0,0,0]
[null,{"$f":"IF(E733=0,0,IMPRIMIR!A732)","v":0},{"$f":"IF(E733=0,0,IMPRIMIR!$D$3)","v":0},0,{"$f":"IMPRIMIR!B732","v":0},{"$f":"IMPRIMIR!C732","v":0},{"$f":"IF(E733=0,0,IMPRIMIR!D732)","v":0},{"$f":"IF(E733=0,0,IMPRIMIR!E732)","v":0},0,0,0]
[null,{"$f":"IF(E734=0,0,IMPRIMIR!A733)","v":0},{"$f":"IF(E734=0,0,IMPRIMIR!$D$3)","v":0},0,{"$f":"IMPRIMIR!B733","v":0},{"$f":"IMPRIMIR!C733","v":0},{"$f":"IF(E734=0,0,IMPRIMIR!D733)","v":0},{"$f":"IF(E734=0,0,IMPRIMIR!E733)","v":0},0,0,0]
[null,{"$f":"IF(E735=0,0,IMPRIMIR!A734)","v":0},{"$f":"IF(E735=0,0,IMPRIMIR!$D$3)","v":0},0,{"$f":"IMPRIMIR!B734","v":0},{"$f":"IMPRIMIR!C734","v":0},{"$f":"IF(E735=0,0,IMPRIMIR!D734)","v":0},{"$f":"IF(E735=0,0,IMPRIMIR!E734)","v":0},0,0,0]
[null,{"$f":"IF(E736=0,0,IMPRIMIR!A735)","v":0},{"$f":"IF(E736=0,0,IMPRIMIR!$D$3)","v":0},0,{"$f":"IMPRIMIR!B735","v":0},{"$f":"IMPRIMIR!C735","v":0},{"$f":"IF(E736=0,0,IMPRIMIR!D735)","v":0},{"$f":"IF(E736=0,0,IMPRIMIR!E735)","v":0},0,0,0]
[null,{"$f":"IF(E737=0,0,IMPRIMIR!A736)","v":0},{"$f":"IF(E737=0,0,IMPRIMIR!$D$3)","v":0},0,{"$f":"IMPRIMIR!B736","v":0},{"$f":"IMPRIMIR!C736","v":0},{"$f":"IF(E737=0,0,IMPRIMIR!D736)","v":0},{"$f":"IF(E737=0,0,IMPRIMIR!E736)","v":0},0,0,0]
[null,{"$f":"IF(E738=0,0,IMPRIMIR!A737)","v":0},{"$f":"IF(E738=0,0,IMPRIMIR!$D$3)","v":0},0,{"$f":"IMPRIMIR!B737","v":0},{"$f":"IMPRIMIR!C737","v":0},{"$f":"IF(E738=0,0,IMPRIMIR!D737)","v":0},{"$f":"IF(E738=0,0,IMPRIMIR!E737)","v":0},0,0,0]